program: Gaussian 09
title: 000137798
version: EM64L-G09RevD.01
frameworkgroup: C1[X(C10H14S)]
method: RPBEPBE
basis: SDD
operation: Freq
keyword: #pfreq=noraman
keyword: PBEPBE/SDD
title: #p freq=noraman PBEPBE/SDD
converged: NO YES NO NO
title: Mulliken charges:
elementType: S C C C C C C C C C C H H H H H H H H H H H H H H
charge: 0.160296 -0.062422 -0.647993 -0.673916 -0.648006 -0.199225 -0.234963 -0.234998 -0.223965 -0.223951 -0.229205 0.225081 0.206536 0.241906 0.231031 0.231029 0.211552 0.241916 0.206536 0.225081 0.254304 0.254297 0.229421 0.229419 0.230238
chargesum: 0.00000
title: Mulliken charges with hydrogens summed into heavy atoms:
elementType: S C C C C C C C C C C
charge: 0.160296 -0.062422 0.025530 -0.000303 0.025527 -0.199225 0.019341 0.019299 0.005455 0.005468 0.001033
polarizability: 1.67777620e+02 1.14721196e-04 1.14724227e+02 -8.16502058e+00 -1.36813168e-03 8.78786100e+01
1716.lowfreq: 0.0014 0.0018 0.0022 6.6930 9.6248 26.2843 33.2023 60.9416 78.6497
frequency: 32.8706 60.2658 78.6037 203.2163 208.7599 240.9937 250.1159 261.5570 271.4243 302.3936 350.1674 382.4381 383.6031 406.4111 426.4375 497.4164 529.1145 611.3484 678.9896 700.1681 756.8409 795.9788 853.4810 927.3297 928.3731 933.3389 952.2756 979.2407 986.4279 997.2794 1015.1509 1022.0284 1022.3112 1069.0569 1072.4920 1163.3645 1170.6859 1180.3691 1239.1624 1240.6540 1295.6307 1370.3901 1375.5938 1378.0947 1401.3911 1423.3295 1448.1303 1456.1628 1463.8384 1464.5860 1472.1429 1476.2457 1492.4308 1582.7241 1587.3054 2969.0583 2972.2836 2977.5761 3061.2288 3065.4481 3073.4962 3083.6986 3089.4716 3091.3859 3125.2377 3134.4352 3148.5850 3156.8451 3167.9240
redmass: 3.0644 3.8635 4.2044 1.0250 4.0782 2.0773 2.1389 1.2974 1.1886 3.6984 3.1170 3.0671 2.4206 2.8388 5.1036 3.3955 3.5064 6.4674 6.7403 2.1414 1.5561 3.1538 1.2391 1.5787 1.3732 1.5636 1.2020 1.3825 6.3720 1.3123 3.3313 1.4327 1.4169 1.5936 2.3804 1.9009 1.0545 1.1222 2.9939 3.0694 1.3330 9.1610 1.2058 1.2162 1.2027 2.0805 1.0484 2.0912 1.0515 1.0488 1.0547 1.0535 1.0503 6.2225 6.0461 1.0367 1.0363 1.0358 1.0968 1.0971 1.0980 1.1013 1.1001 1.1001 1.0846 1.0884 1.0928 1.0964 1.1013
irintensity: 0.0289 0.6886 0.6009 0.0176 1.4498 0.0010 0.2382 0.1211 0.6317 1.1036 1.3590 0.5556 0.0555 0.0076 1.3297 16.3401 3.8258 0.1405 4.6941 43.4614 61.4116 0.7289 0.0824 0.4595 2.1401 2.3907 0.0219 0.0863 3.5325 0.1121 14.8262 2.5992 0.4865 9.2203 3.4583 112.7999 0.0008 0.0880 8.2024 6.0602 0.8254 0.2006 25.5607 29.8393 8.8932 10.0763 0.2957 23.8649 2.2703 1.6025 7.9675 6.5123 20.6051 1.6716 5.9284 23.6116 26.9363 48.7802 4.0013 28.2358 52.5596 1.8971 36.5428 32.2575 0.3509 6.2181 19.9038 26.6183 16.7605
temp: 298.150 k
press: 1.00000 atm
elementType: 16 6 6 6 6 6 6 6 6 6 6 1 1 1 1 1 1 1 1 1 1 1 1 1 1
symmnumber: 1
zpe: 550203.3 jmol-1
zpe.correction: 0.209561 hartree
zpe.thermalcorrener: 0.221587 hartree
zpe.thermalcorrenthalpy: 0.222532 hartree
zpe.thermalcorrgfe: 0.171282 hartree
zpe.sumelectzpe: -786.688307 hartree
zpe.sumelectthermal: -786.676281 hartree
zpe.sumelectthermalent: -786.675336 hartree
zpe.sumelectthermalfe: -786.726586 hartree
dipole: -0.1406 0.0005 1.9943
dipole: 1.9993
quadrupole: -65.9724 -69.7605 -79.8738
quadrupole: 0.0004 -0.2492 -0.0016
quadrupole: 5.8965 2.1084 -8.0049 0.0004 -0.2492 -0.0016
hfenergy: -786.897868 hartree
pointgroup: C01 [X(C10H14S1)]
dipole: 0.049984 0.0007805 -0.7849875 debye
dipolederiv: -0.3168397 0.0001178 -0.1372558 0.0002174 -0.2360346 -0.0001581 -0.1852206 -0.0001539 -0.127659 0.4815777 -0.0001658 0.2581546 -0.0004567 0.1940674 -0.0000696 0.5014845 0. 0.3475174 -0.1013267 0.0135769 -0.0159631 0.0779524 -0.0689115 -0.0305128 -0.0525591 -0.0887517 -0.0557796 -0.1326267 -0.0001315 0.0773361 0.0001154 0.031227 0.000068 -0.1595963 -0.000012 -0.009781 -0.1012608 -0.0135819 -0.0159958 -0.0778693 -0.0692132 0.0304774 -0.052779 0.0886976 -0.0555322 0.4773031 0.0002321 -0.0926454 0.0003175 0.0107573 0.0001421 -0.1867036 0.0001028 -0.1583348 -0.2107242 -0.1042147 -0.0093626 0.0121 0.0170659 0.0123157 0.0400506 0.0311941 -0.1097635 -0.2108144 0.1040701 -0.0091835 -0.0123546 0.0172218 -0.012115 0.0400148 -0.0309573 -0.1098268 -0.0440648 0.0991049 -0.0441716 0.055055 0.0792766 -0.0131177 -0.053629 -0.0339237 -0.1262076 -0.0439579 -0.0991237 -0.0443485 -0.0550495 0.0790865 0.0134402 -0.053753 0.0342372 -0.1261233 0.0530903 0.0001304 -0.1069706 0.000102 -0.0453032 0.0000213 -0.0760346 0.0000298 -0.1168686 0.0977352 -0.025412 0.0199151 -0.0258345 -0.0833173 0.0671136 0.0457358 0.1257491 0.0217398 -0.0310569 -0.0228003 -0.1467389 -0.0137291 0.0748962 -0.0167922 -0.1736679 -0.0415647 -0.0909355 -0.0779215 0.0350601 0.1073676 0.0030888 0.0654819 -0.0059518 0.1134291 0.011179 0.0656876 0.1013756 0.0077636 0.0091305 0.0572779 -0.0672833 -0.1164563 0.0643757 -0.1001617 0.0251249 0.101409 -0.0076731 0.009038 -0.0573153 -0.067791 0.1162624 0.0641881 0.1000029 0.0255901 -0.1126404 0.0000311 -0.0925882 0.0000907 0.1023529 0.0001329 -0.1486117 0.0001164 -0.048979 -0.0778975 -0.0353788 0.1072835 -0.0034212 0.0654661 0.0060254 0.1134319 -0.0111181 0.0656946 -0.0310758 0.0230343 -0.1467051 0.0140119 0.0748019 0.0170299 -0.1736563 0.041792 -0.0908399 0.0976955 0.0255011 0.0200124 0.0258674 -0.0828944 -0.0673147 0.0458741 -0.1259281 0.0213459 0.0763431 0.0902394 0.0404858 0.0720495 -0.0192423 -0.0164217 0.0387449 -0.023918 0.1242234 0.076466 -0.0902358 0.0403182 -0.0720325 -0.0194247 0.0162081 0.0385983 0.0237007 0.1242971 0.0174222 -0.0812226 0.0400605 -0.1018127 -0.0710817 0.0279764 0.0530241 0.029527 0.1415093 0.0172882 0.0812266 0.0402198 0.1017886 -0.0708535 -0.0283092 0.0532234 -0.0298496 0.1414096 -0.1054987 -0.0001483 0.0926071 -0.000159 0.0896491 0.0000058 0.1040358 0.0000102 0.1224911 unknown
polarizability: 167.6631069|0.0216696|114.7242198|-8.7065093|0.0176305|87.9931297 unknown
InChI: InChI=1S/C10H14S/c1-10(2,3)11-9-7-5-4-6-8-9/h4-8H,1-3H3
charge 0 multiplicity 1
25 atoms
S  -1.110361 -0.001724 1.336591
C  -2.269419 -0.000507 -0.239117
C  -2.012425 -1.273235 -1.068413
C  -3.688865 -0.00159 0.370374
C  -2.013223 1.274091 -1.065802
C  0.58196 -0.00049 0.599596
C  1.246588 1.225554 0.349822
C  1.247488 -1.225628 0.347753
C  2.564555 1.224826 -0.163114
C  2.56545 -1.223059 -0.165186
C  3.224979 0.001345 -0.424029
H  -2.191053 -2.181712 -0.466542
H  -2.693297 -1.293698 -1.942327
H  -0.974813 -1.302729 -1.445247
H  -3.857418 0.894028 0.994796
H  -3.856845 -0.898656 0.992866
H  -4.438561 -0.000944 -0.443783
H  -0.975598 1.305041 -1.442487
H  -2.694041 1.295879 -1.939727
H  -2.192507 2.181217 -0.462095
H  0.733568 2.16753 0.569699
H  0.735165 -2.168353 0.566033
H  3.074029 2.176456 -0.351862
H  3.075621 -2.173994 -0.355552
H  4.247725 0.002053 -0.817448
