program: Gaussian 09
title: 000137790
version: EM64L-G09RevD.01
frameworkgroup: C1[X(C16H27N)]
method: RPBEPBE
basis: SDD
operation: Freq
keyword: #pfreq=noraman
keyword: PBEPBE/SDD
title: #p freq=noraman PBEPBE/SDD
converged: YES YES NO NO
title: Mulliken charges:
elementType: N C C C C C C C C C C C C C C C C H H H H H H H H H H H H H H H H H H H H H H H H H H H
charge: -0.432798 -0.384646 -0.379482 -0.381515 -0.366778 -0.373181 -0.457933 -0.353340 -0.349337 -0.356755 -0.696265 0.463667 -0.369674 -0.430059 -0.221053 -0.195920 -0.277887 0.193807 0.193787 0.193209 0.193203 0.192362 0.192289 0.195308 0.195281 0.189932 0.189953 0.208283 0.208568 0.187816 0.187859 0.210437 0.210411 0.194981 0.194958 0.293509 0.209697 0.215469 0.209667 0.237637 0.210303 0.215226 0.216833 0.222172
chargesum: 0.00000
title: Mulliken charges with hydrogens summed into heavy atoms:
elementType: N C C C C C C C C C C C C C C C C
charge: -0.139289 0.002948 0.006930 0.003136 0.023811 0.006704 -0.041082 0.022334 0.071511 0.033183 -0.061432 0.463667 -0.132038 -0.219755 -0.005826 0.020914 -0.055715
polarizability: 2.66934003e+02 4.57615953e+00 1.66897070e+02 -6.11548891e-02 -8.00527200e-03 1.16912921e+02
1716.lowfreq: -0.0014 0.0012 0.0017 1.7008 6.2209 18.7026 23.7939 24.2045 41.4974
frequency: 18.6061 24.1973 41.4849 47.7074 67.7118 74.8778 77.4819 108.0753 117.4089 131.3178 136.2450 148.8526 152.9061 159.2777 218.9740 224.2406 225.6160 291.3471 303.0899 323.9897 397.4809 410.7053 439.6423 480.5582 506.2846 508.6152 595.2574 615.0107 690.7865 722.8037 725.6308 735.5758 752.9310 758.4712 796.7828 814.3144 825.3064 851.2055 867.4720 887.3372 914.3251 953.0450 971.5513 975.9060 976.0929 983.2479 1001.5955 1020.9045 1025.9562 1026.0700 1053.8852 1065.5333 1078.1475 1080.4576 1082.0422 1083.5465 1114.5614 1134.0156 1158.2774 1168.1452 1185.9243 1186.8098 1210.4736 1214.9302 1242.8004 1245.6703 1269.6176 1271.0009 1280.6308 1288.9475 1290.1735 1290.8855 1299.8949 1300.6758 1313.6449 1328.3199 1337.1409 1351.9939 1355.8433 1358.7318 1367.8772 1387.0563 1387.6837 1432.1553 1461.7880 1461.8578 1465.1003 1466.7597 1470.6638 1475.6737 1475.7170 1480.7584 1481.5358 1486.6689 1490.0388 1501.8921 1512.3067 1588.1900 1627.6297 2920.6946 2950.6330 2950.9775 2952.8723 2955.5198 2955.5876 2958.3082 2962.3125 2968.3163 2969.9965 2971.6640 2983.9933 2988.5119 2995.2646 3004.0574 3014.3672 3026.2334 3037.3323 3045.4887 3068.1338 3070.8225 3105.4954 3121.2432 3133.6509 3150.4708 3164.9285 3569.8677
redmass: 4.2464 4.1812 3.8514 1.8264 3.9761 3.1123 1.6421 1.7814 2.5683 4.0133 1.9129 4.5876 2.1936 2.0496 3.5140 1.1395 3.7311 3.7129 1.1327 3.6546 3.1311 2.9350 3.7497 3.0011 2.6716 3.4013 5.3795 6.4110 1.8318 1.0591 1.0709 1.0934 1.7306 1.1556 1.1771 1.2522 5.0456 1.2156 1.5173 1.8968 1.2124 1.3567 1.2863 5.8368 1.1741 5.0966 4.2430 2.5873 1.0848 2.9873 3.2085 2.9180 2.0599 2.0539 1.9438 2.3629 2.4250 3.5317 1.5305 1.0484 1.7412 1.1092 1.2973 1.4512 1.3069 1.3110 1.3590 1.2154 1.0241 1.1088 1.4465 1.0867 1.1061 1.1080 1.3902 1.4867 1.5059 1.5435 1.6866 1.6404 1.7704 3.0666 1.2182 2.4354 1.0722 1.0735 1.0653 1.0771 1.0791 1.0426 1.0824 1.5694 1.2113 1.0947 1.0967 1.2675 2.0154 5.0822 6.2871 1.0567 1.0586 1.0587 1.0591 1.1029 1.0592 1.0590 1.0590 1.0586 1.0583 1.0367 1.0963 1.0977 1.0998 1.1021 1.1041 1.1050 1.1050 1.1047 1.1007 1.0993 1.0869 1.0858 1.0930 1.0934 1.1006 1.0769
irintensity: 0.0984 0.1358 0.0226 0.3959 0.1910 0.8737 0.7881 4.7985 0.0406 0.0515 4.7214 0.0218 0.0001 1.8196 0.0289 0.0029 0.1611 0.2145 83.5745 1.3517 0.1586 0.0829 1.0894 0.3482 14.4909 1.3904 0.9300 0.3515 42.1695 16.9942 0.1230 6.5981 77.0661 7.6766 0.3524 0.4671 8.1573 0.0384 10.3800 5.2673 0.0867 0.0567 0.3867 5.6871 0.6956 0.0494 0.1104 3.1278 0.0616 3.7486 3.8465 3.1379 5.0883 1.1594 2.5575 1.4238 4.9599 17.2227 0.0542 1.4592 0.1096 11.2891 18.8041 0.0120 1.2292 0.0704 4.7132 0.3790 0.0583 0.3932 12.6732 0.1678 0.0838 0.1776 4.4481 33.8655 11.1920 5.2942 0.1641 0.4507 1.9069 56.7557 10.3553 18.4911 0.0091 0.0464 0.0196 0.2548 3.8921 12.4112 0.3092 0.2173 10.0110 1.3390 31.4076 145.4907 112.8289 11.2295 237.6887 52.7719 0.0464 0.2132 0.2665 29.5196 0.1038 5.2885 8.7751 2.0460 286.4276 36.6637 0.0245 0.0775 0.5940 1.6821 0.9404 7.7282 8.2250 263.3919 101.2489 55.1098 16.7156 4.2708 33.4924 45.2018 14.7328 29.2118
temp: 298.150 k
press: 1.00000 atm
elementType: 7 6 6 6 6 6 6 6 6 6 6 6 6 6 6 6 6 1 1 1 1 1 1 1 1 1 1 1 1 1 1 1 1 1 1 1 1 1 1 1 1 1 1 1
symmnumber: 1
zpe: 1033484.4 jmol-1
zpe.correction: 0.393633 hartree
zpe.thermalcorrener: 0.413689 hartree
zpe.thermalcorrenthalpy: 0.414634 hartree
zpe.thermalcorrgfe: 0.342085 hartree
zpe.sumelectzpe: -679.310186 hartree
zpe.sumelectthermal: -679.290130 hartree
zpe.sumelectthermalent: -679.289186 hartree
zpe.sumelectthermalfe: -679.361734 hartree
dipole: -2.7181 -0.7008 0.0048
dipole: 2.8070
quadrupole: -124.4312 -101.3760 -110.8647
quadrupole: -3.2742 0.0102 -0.0173
quadrupole: -12.2072 10.8479 1.3593 -3.2742 0.0102 -0.0173
hfenergy: -679.7038192 hartree
pointgroup: C01 [X(C16H27N1)]
dipole: 1.0691879 -0.276492 -0.0037872 debye
polarizability: 266.9272177|-4.6486672|166.9019598|-0.1243335|0.3049289|116.9148171 unknown
InChI: InChI=1S/C16H27N/c1-2-3-4-5-6-7-8-12-15-17-16-13-10-9-11-14-16/h9-11,13-14,17H,2-8,12,15H2,1H3
charge 0 multiplicity 1
44 atoms
N  -3.160692 -0.708034 -0.002037
C  3.141779 0.392839 0.002204
C  1.885558 -0.506921 -0.000993
C  4.464532 -0.40623 0.001562
C  0.56266 0.291625 0.001933
C  5.722469 0.491398 0.003076
C  -0.687977 -0.614285 -0.001557
C  7.04508 -0.308122 0.001216
C  -2.003376 0.189082 0.001818
C  8.303593 0.589632 0.005109
C  9.619973 -0.21751 0.000377
C  -4.488098 -0.278737 0.001997
C  -4.828107 1.10797 0.011004
C  -5.547485 -1.237975 -0.002891
C  -6.181973 1.507168 0.014994
C  -6.89194 -0.822549 0.001074
C  -7.226353 0.554608 0.010103
H  3.117139 1.06072 -0.884295
H  3.11544 1.056607 0.891744
H  1.912353 -1.16911 -0.891635
H  1.912368 -1.17558 0.88481
H  4.489852 -1.073353 0.888679
H  4.490451 -1.071185 -0.887197
H  0.536712 0.959332 -0.884037
H  0.536596 0.952644 0.89292
H  5.697848 1.155755 0.892348
H  5.69738 1.159261 -0.883565
H  -0.663201 -1.270852 -0.895911
H  -0.663061 -1.278135 0.887374
H  7.072402 -0.97131 -0.888919
H  7.071205 -0.977252 0.88691
H  -2.028234 0.84906 0.897065
H  -2.027954 0.856993 -0.887619
H  8.276345 1.250367 0.895749
H  8.275397 1.259336 -0.878776
H  -2.980981 -1.711355 -0.01029
H  9.686083 -0.861764 -0.896815
H  10.503924 0.446583 0.005535
H  9.684892 -0.873973 0.888777
H  -4.039937 1.867471 0.014718
H  -5.304409 -2.308808 -0.009865
H  -6.420561 2.577609 0.021979
H  -7.686097 -1.578675 -0.002884
H  -8.273594 0.873957 0.013213
