program: Gaussian 09
title: 000137783
version: EM64L-G09RevD.01
frameworkgroup: C1[X(C5H11N)]
method: RPBEPBE
basis: SDD
operation: Freq
keyword: #pfreq=noraman
keyword: PBEPBE/SDD
title: #p freq=noraman PBEPBE/SDD
converged: NO YES NO NO
title: Mulliken charges:
elementType: N C C C C C H H H H H H H H H H H
charge: -0.586411 0.207994 -0.732350 -0.699920 -0.085378 -0.586128 0.216366 0.207514 0.211113 0.237071 0.199233 0.219140 0.238829 0.263951 0.258734 0.208551 0.221691
chargesum: 0.00000
title: Mulliken charges with hydrogens summed into heavy atoms:
elementType: N C C C C C
charge: -0.063726 0.207994 -0.097357 -0.044477 0.153452 -0.155886
polarizability: 7.52832157e+01 -3.82590796e+00 5.65561835e+01 7.60666144e-01 -1.42359752e+00 5.17082719e+01
1716.lowfreq: -26.6437 -13.3105 -0.0007 0.0002 0.0004 9.9144 93.1713 231.2709 266.1368
frequency: 93.0622 231.2464 266.1223 275.1636 279.9451 312.3209 361.9543 385.5703 412.7915 515.0044 633.7329 688.5043 711.2473 887.0421 913.1049 937.8032 946.3282 989.2166 1011.5225 1023.0296 1070.9684 1196.2690 1226.2161 1286.9508 1298.7572 1367.0521 1382.6906 1419.9224 1460.2011 1461.5632 1476.7171 1487.1601 1628.2460 1655.3526 2969.8588 2976.2364 3066.3602 3072.3697 3074.3821 3088.1638 3100.6723 3104.0089 3196.2515 3421.9821 3555.2981
redmass: 2.4051 1.0309 1.1147 2.2934 1.0520 1.8988 2.0920 2.0128 2.2705 2.5143 1.5227 1.7369 3.1434 1.7930 1.5589 1.3439 1.8435 1.2902 1.1795 1.3244 1.3944 2.6996 3.0797 1.3609 2.0216 1.2096 1.2225 1.1870 1.0503 1.0525 1.0508 1.0754 1.1418 4.0988 1.0350 1.0373 1.0985 1.0995 1.0972 1.0670 1.0964 1.0896 1.1139 1.0441 1.0973
irintensity: 0.0785 1.6144 43.9928 9.5945 6.4657 2.0951 7.4293 5.8088 15.6272 6.4918 198.1520 27.1957 0.2725 2.7182 0.7099 74.8299 0.0945 2.6234 15.4605 8.9047 9.1981 30.5050 26.7274 4.8924 12.1846 23.1664 12.0978 15.2664 2.0954 1.6582 9.7742 7.6412 31.0619 19.9622 26.8522 30.7047 6.1117 42.0967 62.8807 11.2393 25.2189 14.9465 28.4114 3.8182 0.1005
temp: 298.150 k
press: 1.00000 atm
elementType: 7 6 6 6 6 6 1 1 1 1 1 1 1 1 1 1 1
symmnumber: 1
zpe: 394279.4 jmol-1
zpe.correction: 0.150173 hartree
zpe.thermalcorrener: 0.158026 hartree
zpe.thermalcorrenthalpy: 0.158970 hartree
zpe.thermalcorrgfe: 0.119379 hartree
zpe.sumelectzpe: -251.347870 hartree
zpe.sumelectthermal: -251.340017 hartree
zpe.sumelectthermalent: -251.339073 hartree
zpe.sumelectthermalfe: -251.378664 hartree
dipole: 0.5558 1.2235 0.0664
dipole: 1.3454
quadrupole: -36.3980 -40.1707 -38.8012
quadrupole: 1.4829 0.3981 1.5249
quadrupole: 2.0586 -1.7140 -0.3446 1.4829 0.3981 1.5249
hfenergy: -251.4980429 hartree
pointgroup: C01 [X(C5H11N1)]
dipole: -0.2373645 -0.4606939 -0.1077488 debye
dipolederiv: -0.3757917 0.0268083 0.1508302 0.0363274 -0.6169664 -0.2345886 0.1514877 -0.1945535 -0.6036028 0.2905424 -0.0292704 -0.1805556 0.1378442 0.3699608 -0.0285212 -0.1694156 0.0667372 0.5134824 0.0172148 -0.0177181 0.0128598 0.0179801 -0.1624977 -0.113816 0.0224185 -0.0484823 -0.0276059 -0.0302135 0.067045 -0.0468573 -0.0241805 -0.0206533 0.054392 0.0179117 0.040357 -0.0071897 0.2477379 -0.0239004 0.0370684 0.0178155 0.0355933 0.146499 0.0168366 0.1185041 -0.1840636 -0.2016897 0.0782623 0.0148753 0.0945037 -0.0215997 0.1843301 0.027378 0.1922826 -0.3163695 0.0332802 0.1035131 -0.0737447 0.0646061 -0.0368006 0.0748331 -0.0734683 0.1052715 -0.0267936 -0.1598111 -0.1097439 -0.0375196 -0.0587772 0.0527809 -0.0142653 -0.02045 -0.016929 0.0844223 0.0367588 0.032037 0.1289082 0.0045776 0.0568716 -0.0201117 0.1042189 -0.039271 -0.1359329 0.1056828 -0.0029493 -0.0142393 0.015961 -0.1360894 -0.0437631 0.0064392 -0.0946814 0.0655075 -0.1985524 -0.050009 -0.0517441 -0.0860988 0.0466283 0.0052409 -0.0433257 0.0142691 0.0750574 0.0488667 -0.0014625 0.1071377 0.0135045 0.092316 -0.0129636 0.071637 0.0190637 -0.115347 0.0519068 0.0069258 -0.0007295 -0.039351 -0.083834 -0.1032928 -0.0292393 -0.1059333 0.0969514 0.1590444 0.0757799 -0.0161226 0.0860848 0.1566038 0.2221096 -0.00239 0.1126492 0.1393279 -0.0258496 -0.0691833 -0.0012755 -0.1976534 0.2747349 0.0616122 -0.0582238 0.0109441 0.1586351 -0.1009818 -0.0764744 -0.0271288 -0.0966133 0.0547672 -0.064008 -0.0290719 -0.0623579 0.1675745 0.1018551 -0.0096599 -0.0017626 0.0134694 -0.0618158 -0.1136867 0.0072568 -0.1178702 0.1159463 unknown
polarizability: 74.9372859|-4.1016858|55.655175|-2.1507468|2.6595848|52.9552102 unknown
InChI: InChI=1S/C5H11N/c1-4-5(2,3)6/h4H,1,6H2,2-3H3
charge 0 multiplicity 1
17 atoms
N  -1.130776 0.050041 1.32314
C  -0.430107 -0.039068 0.005843
C  -0.414678 -1.483402 -0.564198
C  -1.185819 0.904769 -0.97062
C  0.97241 0.525927 0.234291
C  2.155973 -0.053158 -0.085275
H  0.10681 -2.172958 0.125139
H  -1.451927 -1.84537 -0.69139
H  0.086273 -1.534589 -1.548875
H  -1.206833 1.931115 -0.565653
H  -2.231433 0.564495 -1.105507
H  -0.696581 0.919456 -1.959649
H  0.959768 1.51222 0.722426
H  -0.684943 -0.519541 2.052158
H  -2.138131 -0.140157 1.255682
H  3.106905 0.450954 0.121968
H  2.21849 -1.038232 -0.561981
