program: Gaussian 09
title: 000137781
version: EM64L-G09RevD.01
frameworkgroup: C1[X(C9H14)]
method: RPBEPBE
basis: SDD
operation: Freq
keyword: #p
keyword: freq=noraman
keyword: PBEPBE/SDD
title: #p freq=noraman PBEPBE/SDD
converged: YES YES NO NO
title: Mulliken charges:
elementType: C C C C C C C C C H H H H H H H H H H H H H H
charge: -0.104095 -0.310678 -0.448728 -0.448744 -0.462926 -0.462857 -0.581694 0.628056 -0.818340 0.200859 0.221027 0.214705 0.204989 0.204976 0.214721 0.208771 0.226820 0.226790 0.208773 0.217755 0.217768 0.223101 0.218952
chargesum: 0.00000
title: Mulliken charges with hydrogens summed into heavy atoms:
elementType: C C C C C C C C C
charge: 0.096764 -0.089651 -0.029035 -0.029047 -0.027335 -0.027294 -0.146171 0.628056 -0.376287
polarizability: 1.05425254e+02 -2.44193144e-01 8.42671116e+01 2.35513594e-03 -1.28713887e-03 7.74641547e+01
1716.lowfreq: -30.6150 -0.0006 0.0003 0.0005 6.4207 16.8687 54.6132 152.8343 254.6503
frequency: 52.6352 152.8016 254.6178 330.4745 338.3408 367.7274 468.9683 472.4349 558.4351 607.7795 718.2195 738.1175 792.4503 794.8296 815.2189 849.0996 859.7504 900.0567 926.8841 928.8815 954.4291 963.1361 993.3085 1056.6109 1059.8135 1077.4539 1099.3463 1128.2742 1132.7200 1153.6648 1222.3198 1225.9510 1229.5510 1275.3806 1281.0075 1293.5205 1294.7180 1309.4325 1323.6053 1334.5595 1345.6962 1348.7200 1433.0969 1449.8825 1461.4411 1472.5371 1475.6406 1492.5875 1668.9756 2968.4877 2974.6308 2976.0887 2989.5146 2992.3400 3013.6230 3019.2694 3023.0925 3025.8842 3028.8908 3052.4613 3058.7714 3078.9529 3179.0260
redmass: 2.2958 2.0909 1.7026 1.9540 2.3924 2.2390 3.6713 4.3197 2.0749 5.8195 1.1649 3.9090 1.2749 2.7052 1.8126 1.8408 2.5237 1.5174 2.4421 1.3901 2.0117 2.9185 1.8346 2.3093 1.8451 2.0585 1.6243 1.1761 1.1057 1.0286 1.2385 1.4409 1.2142 1.5381 1.7959 1.7633 1.4879 1.3023 1.5165 1.8075 1.4680 1.4100 1.1877 1.0843 1.0755 1.0795 1.0888 1.0918 5.8699 1.0606 1.0599 1.0587 1.0652 1.0625 1.0842 1.1020 1.0881 1.1028 1.0996 1.1039 1.1034 1.0622 1.1136
irintensity: 0.0727 0.3666 0.0148 0.5416 0.2818 0.1826 0.6594 0.9159 6.3340 0.6532 0.4795 0.3858 2.7385 1.2913 5.4880 6.1910 4.5776 3.9217 0.6911 69.7586 5.3248 0.0357 1.5416 1.3539 0.2333 0.0341 1.4187 2.5606 0.2127 0.5221 1.5543 2.4880 1.0944 3.4193 0.7195 2.4653 1.2999 0.1169 1.1917 1.5104 0.0317 1.2885 3.8910 11.4992 0.1599 8.8959 14.8506 3.0359 32.8390 27.2453 31.3212 3.0598 50.7809 91.3476 151.4701 17.8237 7.6826 1.6055 13.5155 50.4321 93.2688 11.9303 22.9161
temp: 298.150 k
press: 1.00000 atm
elementType: 6 6 6 6 6 6 6 6 6 1 1 1 1 1 1 1 1 1 1 1 1 1 1
symmnumber: 1
zpe: 543500.2 jmol-1
zpe.correction: 0.207008 hartree
zpe.thermalcorrener: 0.214918 hartree
zpe.thermalcorrenthalpy: 0.215862 hartree
zpe.thermalcorrgfe: 0.174583 hartree
zpe.sumelectzpe: -350.632900 hartree
zpe.sumelectthermal: -350.624990 hartree
zpe.sumelectthermalent: -350.624046 hartree
zpe.sumelectthermalfe: -350.665325 hartree
dipole: -0.8500 0.0967 0.0000
dipole: 0.8555
quadrupole: -57.0171 -54.0439 -57.2749
quadrupole: 0.1734 0.0005 -0.0006
quadrupole: -0.9051 2.0680 -1.1629 0.1734 0.0005 -0.0006
hfenergy: -350.8399081 hartree
pointgroup: C01 [X(C9H14)]
dipole: 0.3346309 0.0361282 -0.0000441 debye
dipolederiv: 0.1312409 0.0244474 -0.0000154 0.0349628 0.1241839 0.0000128 0.0000477 0.0000017 0.1018532 -0.0238145 0.0586936 0.0000901 0.0127629 0.0754436 -0.000058 0.0001125 -0.0000706 0.0914926 0.124084 -0.0040965 -0.0176762 -0.0089054 0.038417 0.0599218 0.0090713 0.074671 0.0376526 0.1240942 -0.004186 0.0176309 -0.008925 0.0385603 -0.0599195 -0.009174 -0.0746347 0.0374619 0.0658751 -0.0392891 -0.0448551 0.0408623 0.0838149 -0.0039335 -0.0136269 -0.0371338 0.0608939 0.0659895 -0.0393185 0.0447713 0.0408668 0.0837407 0.0039748 0.0136182 0.037209 0.060883 0.0201931 -0.0133913 0.0000436 -0.0745092 -0.0292454 -0.000117 -0.0001137 -0.0001578 0.119936 0.3614434 0.0440328 -0.0000515 0.0065326 0.2256464 0.0002923 -0.0000197 0.0002492 -0.1283752 -0.3331969 -0.028564 0.0000044 -0.0228236 0.0541483 0.0003289 -0.0000262 0.0003346 -0.4542743 -0.0543184 -0.1217776 -0.0000412 -0.136008 -0.1597078 -0.0000629 -0.0000437 -0.0000675 0.0361389 -0.0569757 -0.146196 -0.0000475 -0.0963793 -0.1198081 -0.0000395 -0.0000403 -0.0000329 0.0342338 0.0628349 0.0220356 0.0604397 -0.0270799 -0.0343279 -0.1231046 0.0084552 -0.1058125 -0.1354659 -0.2158094 0.0238225 -0.0512263 0.0609817 0.0261977 0.0125704 0.006897 0.0114837 0.0703593 -0.2157952 0.0236655 0.0516791 0.0608639 0.0262736 -0.0126884 -0.0063971 -0.0115801 0.0702574 0.0627409 0.0222985 -0.0607512 -0.0268545 -0.0346288 0.1232186 -0.0088226 0.1059101 -0.1350435 -0.0666544 0.1320013 -0.0351685 0.0992632 -0.1355956 0.0299915 -0.0288291 -0.0148423 0.0718877 0.0017774 -0.0574714 0.121587 -0.0219271 0.0455291 -0.0016752 0.0907688 0.0353642 -0.1276775 0.0016558 -0.057416 -0.1217295 -0.0218628 0.0455272 0.0017472 -0.0908281 -0.0352244 -0.1275749 -0.066721 0.1320298 0.0353763 0.0992343 -0.1354969 -0.0301786 0.0290058 0.0145934 0.0718322 -0.0031268 0.0035788 -0.0536505 -0.0099213 -0.0233408 0.0882808 -0.0439827 0.1482335 -0.0650198 -0.0030086 0.0032912 0.0535384 -0.0101594 -0.0228996 -0.0882183 0.0438958 -0.1481513 -0.065579 0.0152016 -0.0540488 -0.0000126 -0.1164288 -0.0905781 -0.0001542 -0.0000678 -0.0001692 0.1777321 0.0022901 0.0758583 0.0000646 0.1254538 -0.0818536 -0.0001892 0.0000996 -0.0001732 0.1963955 unknown
polarizability: 105.4273435|0.1241213|84.2650186|-0.0029031|0.0047161|77.4641579 unknown
InChI: InChI=1S/C9H14/c1-7-6-8-2-4-9(7)5-3-8/h8-9H,1-6H2
charge 0 multiplicity 1
23 atoms
C  1.047807 1.079987 0.00021
C  -0.40219 -1.102414 -0.000475
C  1.369944 0.238561 1.265214
C  1.36852 0.240304 -1.266312
C  0.509631 -1.072413 1.263179
C  0.508729 -1.071015 -1.264756
C  -0.462221 1.43622 0.001287
C  -1.285036 0.140154 0.000505
C  -2.641098 0.102536 0.000561
H  1.654076 2.006692 0.000506
H  -1.024191 -2.017299 -0.000755
H  1.162791 0.838405 2.172047
H  2.450077 -0.00297 1.281697
H  2.448717 -0.000784 -1.284658
H  1.159816 0.841248 -2.172062
H  1.160862 -1.967812 1.2555
H  -0.115663 -1.134238 2.172807
H  -0.117136 -1.132376 -2.174018
H  1.160322 -1.966164 -1.258192
H  -0.708941 2.051383 -0.887097
H  -0.707985 2.049684 0.891123
H  -3.189343 -0.847259 0.000004
H  -3.245088 1.018871 0.001185
