program: Gaussian 09
title: 000137762
version: EM64L-G09RevD.01
frameworkgroup: C1[X(C16H27N)]
method: RPBEPBE
basis: SDD
operation: Freq
keyword: #pfreq=noraman
keyword: PBEPBE/SDD
title: #p freq=noraman PBEPBE/SDD
converged: YES YES NO NO
title: Mulliken charges:
elementType: N C C C C C C C C C C C C C C C C H H H H H H H H H H H H H H H H H H H H H H H H H H H
charge: -0.228473 0.143829 0.118624 0.347856 0.517895 -0.607496 0.254013 -0.759353 -0.745752 -0.745719 -0.469530 -0.748493 -0.700411 -0.700450 -0.362945 -0.644038 -0.644052 0.248673 0.219665 0.214476 0.214590 0.201843 0.268381 0.209912 0.201736 0.209875 0.268596 0.246786 0.215895 0.215794 0.215973 0.221791 0.205998 0.217193 0.205994 0.221966 0.216713 0.225599 0.217560 0.241625 0.194343 0.241650 0.217559 0.194306
chargesum: 0.00000
title: Mulliken charges with hydrogens summed into heavy atoms:
elementType: N C C C C C C C C C C C C C C C C
charge: -0.228473 0.143829 0.118624 0.347856 0.517895 -0.358823 0.254013 -0.110621 -0.065616 -0.065512 -0.222744 -0.100831 -0.055429 -0.055777 -0.137345 0.009491 0.009463
polarizability: 2.21464068e+02 1.90937168e+00 1.85274999e+02 -1.01862306e-03 4.29033732e-03 1.35777585e+02
1716.lowfreq: -13.1284 -8.7750 -0.0006 -0.0003 0.0004 9.4580 27.7699 52.9110 59.9905
frequency: 27.5815 52.6517 59.8281 91.5065 119.5054 136.5646 155.7486 161.9417 201.1718 215.6781 227.6704 231.3550 239.1085 242.2250 261.1795 264.2288 276.6714 293.0482 311.9453 325.7824 327.2909 335.7298 349.6205 370.1830 373.7676 392.7651 409.1609 449.3830 455.6027 496.5536 522.3275 542.6202 567.4367 638.8044 653.9490 681.1305 772.1976 783.5326 823.3630 840.6966 885.6290 912.1319 919.5674 924.0961 925.6769 929.4900 932.4360 939.8741 945.5712 957.7048 1016.5351 1023.8943 1024.1374 1026.0204 1030.8211 1074.1283 1081.2777 1124.7917 1138.4591 1146.7493 1163.3441 1187.8259 1204.4967 1205.3169 1211.8950 1217.0652 1250.3638 1268.2639 1284.6617 1294.4761 1344.4694 1357.7957 1366.1881 1373.9491 1376.0393 1392.1915 1396.9016 1406.2244 1415.9267 1436.5069 1451.3109 1457.0236 1460.3995 1464.0690 1464.3665 1468.2793 1470.8109 1472.2730 1475.9275 1479.7350 1480.6096 1487.2110 1488.3754 1492.6170 1495.1861 1499.2554 1509.3040 1567.5800 1606.3598 2870.2406 2880.4560 2967.2605 2972.6112 2972.8876 2973.1459 2977.1160 2978.7421 3012.1127 3012.8834 3058.1292 3060.1206 3065.0544 3066.1799 3067.5063 3069.7161 3071.8142 3075.8236 3080.2621 3080.7467 3083.6443 3084.5308 3110.9267 3111.2259 3114.7115 3156.8229 3160.6588
redmass: 2.7383 2.7653 3.2582 2.7491 2.8261 3.0772 2.8068 2.2740 1.1044 1.1293 1.3824 1.1070 1.2842 1.6322 1.3289 1.7731 2.6589 2.2897 1.1367 2.8497 1.5017 1.4064 2.7807 2.3875 2.4482 2.3395 2.6243 2.9234 3.2923 2.7566 3.0069 3.2132 3.4543 4.4143 3.4831 5.7098 4.2552 3.1824 2.6525 1.5531 2.6565 1.6834 1.6765 1.8125 1.5329 2.1777 2.1600 1.2288 1.2089 1.3740 1.4431 1.3919 1.3872 1.3850 1.5832 2.8583 1.2310 2.3760 1.5362 1.5967 1.6628 3.8846 2.9213 2.9986 2.2311 2.8119 2.6398 2.1809 2.6105 1.9822 7.9683 1.1896 1.2270 1.3549 1.1877 1.4454 1.6947 1.2058 1.1300 1.1588 1.0502 1.0491 1.0510 1.1808 1.0478 1.0540 1.0497 1.1140 1.0550 1.0820 1.0476 1.1427 1.0504 1.0513 1.3739 1.2202 1.0619 6.5943 5.8118 1.0543 1.0550 1.0354 1.0366 1.0350 1.0349 1.0373 1.0360 1.0770 1.0761 1.0999 1.0993 1.0999 1.1001 1.0997 1.0981 1.1003 1.0985 1.0990 1.0993 1.0984 1.0997 1.0972 1.0884 1.0966 1.0910 1.0904
irintensity: 0.0510 0.0502 0.5500 0.2010 0.5603 0.8083 0.4231 0.1418 0.1741 0.3555 0.3503 0.1997 0.0564 0.0977 0.3516 0.5808 0.2577 0.3466 0.1673 2.3061 0.1984 0.6775 4.7491 0.0117 0.3689 0.1523 1.4401 1.0399 0.2755 2.4315 1.1259 10.8029 3.9349 3.8296 6.8927 2.1067 2.9429 0.8642 1.9872 19.7120 22.6732 1.1661 2.7316 15.2547 5.7687 7.1547 18.1029 0.8514 1.3051 0.0162 1.4146 0.4617 2.5487 0.0450 12.6014 36.1556 6.0204 11.4903 5.8838 20.9006 2.5908 11.4904 9.7458 4.0396 5.4889 2.7651 55.6765 9.3273 7.2299 9.8282 3.0871 23.4133 14.2023 13.1252 19.2290 0.5544 37.5606 13.0016 5.4815 0.6724 0.0016 7.2637 0.1659 14.0672 0.3210 4.4422 5.8600 34.0389 5.9445 19.1817 12.5375 0.1853 10.0622 1.7522 9.8936 58.6451 19.1435 0.4550 10.6003 60.1393 173.4596 23.7839 37.7134 29.7204 44.0515 57.5996 31.6009 13.0415 84.4283 5.9796 8.1199 36.7740 10.6608 8.1751 120.7148 20.9426 118.7280 24.1797 23.1849 58.4532 42.6168 0.5263 17.7302 23.3600 21.1610 10.5317
temp: 298.150 k
press: 1.00000 atm
elementType: 7 6 6 6 6 6 6 6 6 6 6 6 6 6 6 6 6 1 1 1 1 1 1 1 1 1 1 1 1 1 1 1 1 1 1 1 1 1 1 1 1 1 1 1
symmnumber: 1
zpe: 1024125.6 jmol-1
zpe.correction: 0.390069 hartree
zpe.thermalcorrener: 0.410095 hartree
zpe.thermalcorrenthalpy: 0.411039 hartree
zpe.thermalcorrgfe: 0.343587 hartree
zpe.sumelectzpe: -679.289387 hartree
zpe.sumelectthermal: -679.269361 hartree
zpe.sumelectthermalent: -679.268417 hartree
zpe.sumelectthermalfe: -679.335869 hartree
dipole: 0.2526 -0.7380 0.0009
dipole: 0.7800
quadrupole: -101.9918 -102.5481 -109.0431
quadrupole: 2.8572 -0.0052 0.0033
quadrupole: 2.5359 1.9796 -4.5155 2.8572 -0.0052 0.0033
hfenergy: -679.6794557 hartree
pointgroup: C01 [X(C16H27N1)]
dipole: -0.0990655 -0.2904505 0.0021985 debye
polarizability: 221.467733|-1.8711091|185.2666736|0.1473901|-0.4700639|135.7822458 unknown
InChI: InChI=1S/C16H27N/c1-15(2,3)12-9-10-14(17(7)8)13(11-12)16(4,5)6/h9-11H,1-8H3
charge 0 multiplicity 1
44 atoms
N  2.606748 -1.120886 0.011747
C  1.642144 1.79111 -0.016613
C  -3.16928 -0.003164 -0.007663
C  0.698442 0.556564 -0.006634
C  -1.654095 -0.323174 -0.001665
C  -0.709656 0.737045 -0.010657
C  1.176275 -0.796252 0.006994
C  0.86238 3.135086 -0.028464
C  2.54538 1.762941 -1.286232
C  2.543954 1.78464 1.254379
C  -1.148401 -1.643233 0.012031
C  -4.041242 -1.285485 0.008851
C  -3.52356 0.809292 -1.290026
C  -3.527321 0.843497 1.251383
C  0.244044 -1.861821 0.01601
C  3.060956 -1.821514 -1.211899
C  3.057887 -1.800192 1.248389
H  -1.094864 1.760019 -0.021053
H  1.589471 3.967849 -0.033354
H  0.228848 3.24272 -0.928838
H  0.225254 3.25628 0.867653
H  3.18017 2.66935 -1.316515
H  3.200551 0.87859 -1.268447
H  1.933054 1.741594 -2.207224
H  3.178279 2.691741 1.270358
H  1.930589 1.778295 2.174895
H  3.199476 0.900399 1.251781
H  -1.824852 -2.502844 0.019891
H  -5.110978 -1.006448 0.004168
H  -3.855913 -1.917284 -0.879423
H  -3.857328 -1.893343 0.914004
H  -3.293105 0.225711 -2.200193
H  -4.601833 1.05795 -1.300157
H  -2.956202 1.75551 -1.342536
H  -4.606995 1.086203 1.255106
H  -3.293151 0.287608 2.177784
H  -2.965921 1.794372 1.276923
H  0.623559 -2.891735 0.026507
H  4.166067 -1.873848 -1.212087
H  2.738511 -1.25841 -2.10406
H  2.669609 -2.864111 -1.305242
H  2.733341 -1.221709 2.129907
H  4.162997 -1.852513 1.252217
H  2.666311 -2.8410 1.358902
