program: Gaussian 09
title: 000137758
version: EM64L-G09RevD.01
frameworkgroup: C1[X(C6H6O6)]
method: RPBEPBE
basis: SDD
operation: Freq
keyword: #p
keyword: freq=noraman
keyword: PBEPBE/SDD
title: #p freq=noraman PBEPBE/SDD
converged: YES YES NO NO
title: Mulliken charges:
elementType: O O O O O O C C C C C C H H H H H H
charge: -0.220368 -0.220421 -0.444777 -0.444687 -0.182723 -0.182763 -0.107149 -0.107247 -0.199264 -0.199528 0.193919 0.193875 0.306534 0.306495 0.281646 0.281644 0.372397 0.372417
chargesum: 0.00000
title: Mulliken charges with hydrogens summed into heavy atoms:
elementType: O O O O O O C C C C C C
charge: -0.220368 -0.220421 -0.072380 -0.072270 -0.182723 -0.182763 0.199385 0.199248 0.082382 0.082116 0.193919 0.193875
polarizability: 1.02284704e+02 -3.14566167e+00 6.15447128e+01 -2.60133415e-04 -2.19290390e-02 6.88490506e+01
1716.lowfreq: -7.6161 -0.0016 -0.0013 -0.0010 3.2766 5.7414 36.9746 87.5735 95.1928
frequency: 36.9734 87.5731 95.1436 191.6148 210.4719 227.9174 263.6770 338.7357 346.0387 349.9855 382.0990 435.4036 497.8130 617.5255 630.3447 651.0299 669.8216 697.6310 796.2714 823.1273 830.3276 860.7438 941.8775 969.2392 986.1995 995.8517 1029.5959 1033.7338 1090.6741 1095.6063 1164.1436 1174.3346 1244.1071 1247.0301 1268.1578 1274.3157 1281.9080 1289.7240 1359.3803 1370.1868 1705.2697 1713.8870 3041.6203 3041.9177 3106.6295 3117.2062 3559.1558 3559.3450
redmass: 8.5616 9.6165 6.9337 5.3787 9.2465 5.8837 6.5831 1.1519 1.4238 3.6706 8.2683 8.7277 5.0691 7.5163 5.0514 8.0499 7.7680 8.5917 9.2540 6.6304 5.8677 3.3443 4.7819 4.5724 3.6442 6.2599 2.7446 2.1861 3.4895 3.2873 1.2363 1.1831 1.2112 1.5015 1.2626 1.2469 1.5367 1.6565 1.6999 1.7561 12.7251 12.7153 1.0860 1.0857 1.0881 1.0895 1.0665 1.0666
irintensity: 5.4938 0.0050 8.1436 0.7938 1.0276 4.7752 30.7769 2.8648 288.7073 96.8551 0.0262 0.0037 10.8234 9.9790 1.2118 20.1821 3.2961 6.7489 8.4742 69.7509 4.7043 19.4506 149.3077 44.2731 37.5458 94.0341 57.3907 29.3438 340.5368 2.2348 7.9989 19.9252 1.6772 20.0437 11.9611 10.3241 1.4933 2.2707 10.0721 17.4885 424.1241 183.6306 13.7976 9.8322 1.7549 4.2947 44.1431 5.9897
temp: 298.150 k
press: 1.00000 atm
elementType: 8 8 8 8 8 8 6 6 6 6 6 6 1 1 1 1 1 1
symmnumber: 1
zpe: 321205.5 jmol-1
zpe.correction: 0.122341 hartree
zpe.thermalcorrener: 0.132941 hartree
zpe.thermalcorrenthalpy: 0.133885 hartree
zpe.thermalcorrgfe: 0.085385 hartree
zpe.sumelectzpe: -682.648192 hartree
zpe.sumelectthermal: -682.637592 hartree
zpe.sumelectthermalent: -682.636648 hartree
zpe.sumelectthermalfe: -682.685148 hartree
dipole: -0.0037 -0.0018 2.4440
dipole: 2.4440
quadrupole: -66.0789 -72.9774 -75.8206
quadrupole: -12.1355 -0.0388 0.0158
quadrupole: 5.5467 -1.3518 -4.1950 -12.1355 -0.0388 0.0158
hfenergy: -682.7705331 hartree
pointgroup: C01 [X(C6H6O6)]
dipole: 0.0007962 -0.0367728 0.9608391 debye
dipolederiv: -1.1380925 0.1613988 -0.3989889 0.4837674 -0.5328928 0.1480573 -0.3463687 0.0186637 -0.433472 -1.1359913 0.1288579 0.41372 0.4538112 -0.5189483 -0.1565701 0.3854835 -0.0257749 -0.4498555 -0.5442065 0.063454 -0.2993296 0.0691664 -0.6101394 0.0254934 -0.2879313 0.0477476 -0.4042583 -0.5412669 0.0387752 0.3040771 0.0453636 -0.602964 -0.0418829 0.2933517 -0.0642097 -0.414636 -0.9214514 0.0038263 -0.3612704 -0.0881012 -0.4663009 -0.1364818 -0.4532507 -0.0550885 -0.5924905 -0.9189212 -0.0248591 0.3612938 -0.1234566 -0.4824857 0.1454827 0.4458912 0.0641561 -0.5791047 0.4513294 0.0648584 0.1176087 0.1372544 0.1457507 0.1089591 0.3178198 -0.0006794 0.3551745 0.4493492 0.0740515 -0.1127117 0.1614495 0.1559639 -0.1253803 -0.3064284 -0.0155164 0.3474759 0.4146765 -0.0661929 0.2487466 -0.0386326 0.1846662 0.0684835 0.2304482 0.0940738 0.2906058 0.4127378 -0.0461382 -0.2536317 -0.0199648 0.1989897 -0.0757268 -0.2333951 -0.1015049 0.2791085 1.4883658 -0.1933387 0.7110884 -0.4718139 0.8035752 -0.0029802 0.7544987 0.1317086 0.628412 1.4841097 -0.1361573 -0.7272752 -0.4096143 0.8128526 0.0193264 -0.7917857 -0.116423 0.6236789 0.0357692 -0.0345733 -0.0032049 -0.0586119 0.0508789 0.0355901 -0.041407 0.0428393 -0.0164146 0.0357787 -0.0350372 0.0000073 -0.0619091 0.0565771 -0.0294934 0.0363927 -0.0369852 -0.022579 0.0357186 0.0290002 -0.0155437 0.0073439 -0.0047386 -0.064203 -0.0403625 -0.062251 -0.0381784 0.0359595 0.0281661 0.0174531 0.004524 -0.0153061 0.0660658 0.0403974 0.0640811 -0.0278685 0.1787359 -0.0325914 0.1123262 -0.0513156 0.4125215 0.011977 0.1474052 -0.0018747 0.2263428 0.1773994 -0.0235006 -0.1143651 -0.0392603 0.4119997 0.0032832 -0.150759 0.0170376 0.2280591 unknown
polarizability: 101.9814851|-4.6999496|61.8584344|-0.2566322|-0.2736488|68.8385475 unknown
InChI: InChI=1S/C6H6O6/c7-1-3-4(12-5(1)9)2(8)6(10)11-3/h1-4,7-8H
charge 0 multiplicity 1
18 atoms
O  -0.806865 -1.360901 -0.306931
O  0.801944 1.381537 -0.202863
O  2.480257 -1.047412 1.245376
O  -2.477164 0.942178 1.337234
O  -2.779649 -0.695267 -1.352342
O  2.772037 0.801967 -1.303191
C  0.159613 -0.788821 0.671787
C  -0.159755 0.73386 0.732647
C  1.575013 -0.891687 0.103508
C  -1.577972 0.88089 0.181629
C  -1.828743 -0.428151 -0.60681
C  1.823386 0.4762 -0.578387
H  0.049837 -1.318607 1.628024
H  -0.044432 1.186245 1.727227
H  1.672587 -1.713801 -0.627954
H  -1.680222 1.759373 -0.480347
H  3.419445 -1.014664 0.92815
H  -3.418018 0.93476 1.023343
