program: Gaussian 09
title: 000137757
version: EM64L-G09RevD.01
frameworkgroup: C1[X(C10H11BrO2)]
method: RPBEPBE
basis: SDD
operation: Freq
keyword: #p
keyword: freq=noraman
keyword: PBEPBE/SDD
title: #p freq=noraman PBEPBE/SDD
converged: YES YES NO NO
title: Mulliken charges:
elementType: Br O O C C C C C C C C C C H H H H H H H H H H H
charge: -0.000095 -0.363867 -0.184336 0.218414 0.014334 0.318851 0.124873 -0.483806 -0.236089 -0.361083 -0.267833 -0.860828 -0.689983 0.236719 0.227061 0.266904 0.257075 0.256229 0.239261 0.243681 0.228037 0.209340 0.235374 0.371768
chargesum: 0.00000
title: Mulliken charges with hydrogens summed into heavy atoms:
elementType: Br O O C C C C C C C C C C
charge: -0.000095 0.007901 -0.184336 0.218414 0.014334 0.318851 0.124873 -0.020026 0.030815 -0.104008 -0.267833 -0.121657 -0.017233
polarizability: 1.79878877e+02 5.78654395e+00 1.58376079e+02 -2.21903639e+00 9.98840138e-01 6.43789261e+01
1716.lowfreq: -6.5683 -0.0008 -0.0004 -0.0003 3.8257 5.2665 15.6600 69.5302 88.0612
frequency: 15.5733 69.5272 88.0535 105.3843 118.5581 160.4265 185.0367 193.9848 206.2966 248.1480 286.3397 310.2634 325.7449 337.5202 345.4220 386.4719 448.9442 496.4579 544.2631 564.1993 583.4856 642.8254 709.6342 735.3766 799.3523 812.5835 856.8799 881.7130 894.7114 973.2609 1002.5998 1038.2598 1043.3917 1065.1865 1097.2644 1114.1854 1169.0624 1224.1799 1250.2578 1256.7200 1275.0637 1323.1347 1381.6368 1395.3564 1398.4530 1404.7350 1435.4856 1442.3655 1467.2267 1477.8746 1479.1360 1483.0096 1577.5829 1582.8246 1612.3835 2956.6854 2966.5730 2997.6931 3018.9822 3026.6074 3093.1930 3095.0456 3103.2504 3156.9398 3186.1660 3541.0205
redmass: 5.5613 2.6569 2.9017 5.4661 3.3747 1.1929 1.3807 4.1428 1.8406 6.6342 6.2504 4.1954 4.2452 3.0618 1.4505 7.5322 3.1535 4.8625 3.3822 3.9342 2.6860 5.1726 5.1426 4.0465 5.5227 1.4817 5.4894 1.4116 1.4010 2.0991 1.6218 1.9582 1.5170 1.6419 2.3127 2.1442 1.9880 3.8682 1.2408 1.5255 2.0979 1.8201 4.0320 1.2212 1.5236 2.7400 2.3371 1.1492 1.0397 1.0507 1.0432 1.2200 7.4686 6.3101 8.3825 1.0406 1.0610 1.0365 1.0974 1.0981 1.1003 1.0944 1.0998 1.0930 1.0914 1.0650
irintensity: 6.0208 0.1933 0.4211 0.7894 0.7864 0.1217 0.1490 2.3673 2.9731 1.1058 1.9988 4.6763 21.8544 19.7676 77.9308 8.3974 10.1827 7.9975 3.3414 3.2328 8.9500 31.3868 22.8376 3.0923 10.5667 19.9049 46.5340 19.4261 0.7853 29.7170 8.7610 55.7895 7.1052 0.9611 16.4759 17.9106 175.8829 157.8174 0.4584 4.6063 53.1532 29.5993 53.6105 27.9744 50.5757 2.4615 57.8074 12.8634 12.0796 14.1100 16.4395 21.0361 131.8989 8.4697 39.4460 26.5521 30.6719 32.0680 11.3454 17.2586 27.7747 9.5666 29.1563 3.2248 0.3705 37.5050
temp: 298.150 k
press: 1.00000 atm
elementType: 35 8 8 6 6 6 6 6 6 6 6 6 6 1 1 1 1 1 1 1 1 1 1 1
symmnumber: 1
zpe: 481293.4 jmol-1
zpe.correction: 0.183315 hartree
zpe.thermalcorrener: 0.197239 hartree
zpe.thermalcorrenthalpy: 0.198183 hartree
zpe.thermalcorrgfe: 0.140709 hartree
zpe.sumelectzpe: -550.602245 hartree
zpe.sumelectthermal: -550.588322 hartree
zpe.sumelectthermalent: -550.587378 hartree
zpe.sumelectthermalfe: -550.644852 hartree
dipole: -2.1979 2.1946 0.8023
dipole: 3.2080
quadrupole: -102.8416 -65.5592 -88.2436
quadrupole: -7.1708 2.6328 1.1511
quadrupole: -17.2935 19.9890 -2.6955 -7.1708 2.6328 1.1511
hfenergy: -550.7855604 hartree
pointgroup: C01 [X(C10H11Br1O2)]
dipole: 1.1976532 -0.2845831 0.2784921 debye
dipolederiv: -0.2020327 -0.2408352 0.0127982 -0.2987428 -0.6107009 0.0291645 0.0129604 0.0289444 -0.0405022 -0.1194672 -0.3936455 0.0380892 -0.2162237 -1.2617963 0.0538523 0.0249489 0.0627754 -0.3644836 -0.9156618 -0.142474 -0.0167972 -0.2886092 -0.612106 -0.1012118 -0.0251305 -0.095485 -0.2975412 -0.8416247 0.079761 0.0023366 -0.0638973 -0.1488289 -0.0187224 0.0431136 -0.0011834 -0.0350367 0.0581319 0.5417929 -0.0324201 0.0857731 1.0895038 -0.0782727 -0.0492391 -0.0849877 0.0766589 0.0670061 -0.4171154 0.0254059 -0.1142849 -0.0368469 0.0009384 0.0100476 0.0029781 -0.0667157 1.7450809 -0.0573371 -0.0114417 -0.0709827 0.7292558 0.1895995 -0.0399529 0.1395301 0.1439554 -0.1442206 0.1022319 0.0263241 0.2808076 -0.2509206 -0.0790482 0.0225175 -0.0438025 0.1420128 0.1177972 -0.1481332 0.0030382 0.0697862 -0.2923141 0.0164797 0.0488441 0.0050914 -0.0830861 -0.0138234 -0.1443801 0.0072699 -0.1945475 -0.1307462 0.0027211 0.0075214 0.0031595 -0.0834447 -0.0280995 0.6022303 -0.0294262 0.6677225 0.9872968 -0.0598054 -0.0332864 -0.0571162 -0.138063 -0.0396074 0.0427135 0.0000121 0.0544793 -0.0777903 0.0057227 -0.0036662 0.0102393 0.0818474 -0.0406393 -0.0253524 0.0035297 0.0030597 0.0876832 0.0000419 0.0176123 -0.0084777 0.057024 -0.0260641 -0.0248368 -0.0862712 -0.0434886 0.046042 -0.0597581 -0.0953979 -0.0797792 -0.0380893 0.0244865 -0.0311815 0.0737467 -0.0459131 0.001955 0.082519 0.0830118 0.0939135 -0.0232576 0.1011169 0.0783841 -0.0086698 0.0874828 0.0241238 0.0013143 -0.0148779 0.0045593 0.1397534 -0.0550973 -0.0064372 0.0030423 0.0021451 0.1079514 0.0020539 0.0016136 0.0016606 0.1509623 -0.0880908 0.0037671 0.0042152 -0.1192516 0.0940418 0.0039145 0.0112242 0.0013841 0.1231113 0.076246 -0.0097605 0.0643647 0.047462 -0.0327387 0.0906368 0.0126141 0.1082094 -0.0479328 0.0745917 -0.0217091 -0.0659187 0.0416216 -0.0492452 -0.0887425 -0.0209603 -0.1038768 -0.0188172 0.0592726 -0.003902 0.0149715 -0.0713606 0.016691 0.1240493 0.040008 0.0984046 -0.04783 -0.0402236 0.093118 0.0255815 0.1682963 -0.098158 -0.0385345 0.0372265 -0.032132 0.0954501 0.0607168 -0.0165774 -0.0407974 -0.0860135 0.0688189 -0.0797305 -0.0807429 -0.0642184 -0.0664158 0.1702059 0.1396786 -0.0129836 0.1046792 0.3488286 0.0008181 -0.0100098 0.0102091 0.3404404 unknown
polarizability: 169.0285002|12.1728374|169.1934472|-1.7503379|-2.6845407|64.4119343 unknown
InChI: InChI=1S/C10H11BrO2/c1-3-9(12)8-5-7(11)4-6(2)10(8)13/h4-5,13H,3H2,1-2H3
charge 0 multiplicity 1
24 atoms
Br 2.374702 3.184969 -0.098718
O  -0.099119 -2.456595 0.201789
O  -2.49339 -1.263259 -0.192647
C  -0.405608 -0.048976 0.062458
C  0.463766 -1.184354 0.112992
C  1.885345 -1.032936 0.095795
C  -1.909406 -0.169803 0.043988
C  -2.733517 1.103607 0.317598
C  0.191932 1.243181 0.010257
C  2.436172 0.263754 0.029521
C  1.585181 1.386983 -0.009993
C  2.782401 -2.257384 0.148698
C  -4.240662 0.817481 0.431641
H  -2.355742 1.58999 1.239009
H  -2.551843 1.826687 -0.504979
H  -0.441072 2.131794 -0.026704
H  3.52275 0.391126 0.011331
H  3.843625 -1.96395 0.111541
H  2.644374 -2.838045 1.083616
H  2.607261 -2.939416 -0.707659
H  -4.44922 0.126294 1.266291
H  -4.800365 1.754696 0.601192
H  -4.619836 0.337801 -0.486191
H  0.60947 -3.147644 0.262876
