program: Gaussian 09
title: 000011610
version: EM64L-G09RevD.01
frameworkgroup: C1[X(C7H14)]
method: RPBEPBE
basis: SDD
operation: Freq
keyword: #p
keyword: freq=noraman
keyword: PBEPBE/SDD
title: #p freq=noraman PBEPBE/SDD
converged: YES YES NO NO
title: Mulliken charges:
elementType: C C C C C C C H H H H H H H H H H H H H H
charge: -0.341502 -0.368705 -0.354956 -0.453483 -0.693548 -0.032684 -0.597659 0.189852 0.184940 0.190714 0.208281 0.196561 0.194491 0.196696 0.203786 0.209947 0.209499 0.215710 0.211575 0.213428 0.217055
chargesum: 0.00000
title: Mulliken charges with hydrogens summed into heavy atoms:
elementType: C C C C C C C
charge: 0.033290 0.030291 0.036097 -0.053002 -0.058392 0.178892 -0.167176
polarizability: 1.01598891e+02 -1.00259944e+00 6.30914690e+01 8.31380882e+00 3.23308958e+00 6.46662636e+01
1716.lowfreq: -43.4489 -14.3564 -0.0007 -0.0003 0.0010 6.7993 51.8448 57.0027 96.2080
frequency: 50.7041 56.6843 96.1460 117.4272 134.4940 234.8603 267.4712 321.6533 421.4038 444.9065 637.0978 721.3922 750.1858 833.5606 881.7305 926.3841 937.4908 949.8092 1001.4365 1003.9917 1033.6245 1054.1548 1077.1039 1110.2173 1174.4431 1205.2674 1233.3253 1255.9932 1277.7205 1286.9410 1290.6370 1296.2358 1334.2962 1349.8131 1387.4853 1425.3786 1458.7806 1462.2104 1469.1327 1477.5929 1479.2477 1486.7837 1657.9627 2951.6580 2953.0429 2962.8659 2969.3246 2971.8639 2991.2828 3008.8060 3022.7163 3042.8094 3068.5611 3070.3754 3070.9943 3089.2424 3192.4273
redmass: 2.3755 2.2297 2.2575 2.2984 2.1462 1.1046 2.3505 3.3812 2.3398 2.1300 1.5376 1.0683 1.1362 1.2219 2.0356 1.4686 1.3125 1.4095 1.1353 3.5399 1.4032 2.6409 2.2897 2.1815 2.0597 1.5267 1.2963 1.2424 1.1499 1.1036 1.1870 1.2850 1.4394 1.6371 1.2154 1.1775 1.0937 1.0682 1.0798 1.0458 1.0746 1.0827 4.7268 1.0603 1.0599 1.0602 1.0597 1.0367 1.0968 1.0973 1.1019 1.1032 1.0995 1.0806 1.0991 1.0741 1.1144
irintensity: 0.0599 0.0068 0.0861 0.0151 0.0160 0.0013 0.1375 0.0553 1.0928 1.3691 15.9810 10.7357 0.9972 3.0950 2.6774 2.7204 82.1997 4.9871 12.2245 2.7946 11.6614 1.6028 0.1965 8.1696 1.8499 1.0096 1.7380 0.2126 0.2444 0.7924 0.1143 0.6884 0.4894 0.9418 11.0018 3.4697 3.3324 0.1536 2.1851 11.0491 6.5379 20.2711 21.0748 1.3837 21.6620 0.9703 127.4340 33.2723 3.2842 4.5660 3.5869 77.8619 65.8042 71.7828 56.4578 6.9800 33.3949
temp: 298.150 k
press: 1.00000 atm
elementType: 6 6 6 6 6 6 6 1 1 1 1 1 1 1 1 1 1 1 1 1 1
symmnumber: 1
zpe: 499076.9 jmol-1
zpe.correction: 0.190088 hartree
zpe.thermalcorrener: 0.199583 hartree
zpe.thermalcorrenthalpy: 0.200528 hartree
zpe.thermalcorrgfe: 0.155007 hartree
zpe.sumelectzpe: -274.531172 hartree
zpe.sumelectthermal: -274.521677 hartree
zpe.sumelectthermalent: -274.520733 hartree
zpe.sumelectthermalfe: -274.566254 hartree
dipole: 0.5287 0.0259 0.1516
dipole: 0.5507
quadrupole: -48.2496 -46.3106 -45.3190
quadrupole: -0.5836 0.4134 1.6060
quadrupole: -1.6232 0.3158 1.3074 -0.5836 0.4134 1.6060
hfenergy: -274.7212609 hartree
pointgroup: C01 [X(C7H14)]
dipole: 0.2077264 -0.0087393 0.0609143 debye
dipolederiv: -0.0540048 -0.0088186 0.0113969 -0.078686 0.0809889 -0.0271974 -0.0022012 -0.020039 0.1816024 0.0022979 0.0101567 0.0085429 0.0809233 0.0724608 0.0176259 0.0437225 -0.0089964 0.1928065 0.0151258 0.0032433 0.0067581 0.0668139 0.1018104 -0.0036629 0.0171115 -0.0088238 0.1737188 -0.166906 0.033605 -0.0012071 0.0439237 0.1146133 -0.0554539 -0.0194386 -0.0310106 0.1417832 -0.0836677 0.0376905 0.0138025 -0.0074151 0.05826 -0.0091958 0.010523 -0.0082329 0.0941961 0.2376809 -0.1507567 0.0813319 -0.2992885 -0.0763233 0.1156237 0.0131953 0.1402412 0.0914504 -0.2615943 -0.1405361 -0.0225159 -0.1138961 -0.2571122 0.2017292 -0.0588261 0.209091 -0.0600138 0.0365927 -0.0085886 -0.0048669 0.0029511 -0.0133346 -0.1062345 0.0066487 -0.1317267 -0.1249766 0.0316344 0.0105953 -0.0112046 0.0171994 -0.0854807 0.1201598 -0.0158121 0.1468303 -0.0575168 0.047131 -0.007231 0.0035215 0.005241 -0.0099181 -0.1019537 0.0038352 -0.1316992 -0.1262417 0.0385968 0.007235 -0.0066162 0.0030134 -0.0713476 0.1075717 -0.0059126 0.1319301 -0.0450689 0.0249049 0.0426563 -0.0339647 0.0118847 -0.081601 0.1206211 -0.0163731 0.1498397 -0.0496437 0.0291555 0.0139143 0.0277401 -0.0052743 -0.0090667 -0.1104591 0.0025317 -0.1423587 -0.1307869 0.0197355 0.0551372 -0.0480703 0.0490681 -0.0602289 0.1180662 0.0005199 0.137402 -0.0313116 0.0274289 -0.0076424 -0.0116691 -0.0039713 0.0102329 -0.0826543 0.0123954 -0.1297387 -0.1128304 0.0763726 0.0010247 -0.0233124 0.0437737 0.0200781 -0.1115132 0.0321275 -0.1224181 -0.1248191 0.0735987 0.0151065 0.0051739 0.0689605 -0.0509229 0.1265218 -0.0379303 0.1424284 -0.0526895 -0.165661 -0.1098928 -0.0012225 -0.1469663 -0.0137181 -0.0061979 -0.0028569 -0.0083728 0.0987981 0.0541049 0.0280954 -0.0235283 0.0764787 0.0605169 -0.1183162 0.02233 -0.1285261 -0.0879496 -0.0779298 0.1201415 0.0125001 0.1501897 0.1101418 -0.061375 0.0093556 -0.0672833 0.0885248 0.095403 0.0548646 0.01741 0.0350767 0.0999507 -0.1337054 -0.0149453 -0.1185362 -0.0590317 unknown
polarizability: 101.5037568|-3.5875997|61.4282868|7.8062544|2.1748405|66.4245796 unknown
InChI: InChI=1S/C7H14/c1-3-5-7-6-4-2/h3H,1,4-7H2,2H3
charge 0 multiplicity 1
21 atoms
C  1.271466 -0.387865 -0.022178
C  -0.072549 0.350821 0.16583
C  2.495438 0.555309 0.026097
C  -1.29781 -0.601968 0.114343
C  3.835936 -0.186962 -0.163917
C  -2.607861 0.114327 0.365493
C  -3.660895 0.156696 -0.489554
H  1.263019 -0.926778 -0.992775
H  1.377275 -1.16565 0.763341
H  -0.065433 0.885379 1.138626
H  -0.185474 1.12788 -0.616452
H  2.386347 1.332836 -0.757335
H  2.502726 1.092253 0.99677
H  -1.155249 -1.392174 0.88253
H  -1.330903 -1.113794 -0.867285
H  3.866509 -0.706219 -1.140509
H  3.98209 -0.94927 0.624703
H  4.694107 0.508951 -0.124374
H  -2.682563 0.646437 1.328194
H  -4.580211 0.701644 -0.246196
H  -3.632366 -0.355252 -1.45995
