program: Gaussian 09
title: 000137738
version: EM64L-G09RevD.01
frameworkgroup: C1[X(C14H14S)]
method: RPBEPBE
basis: SDD
operation: Freq
keyword: #pfreq=noraman
keyword: PBEPBE/SDD
title: #p freq=noraman PBEPBE/SDD
converged: YES YES NO NO
title: Mulliken charges:
elementType: S C C C C C C C C C C C C C C H H H H H H H H H H H H H H
charge: 0.219551 0.339388 0.326076 -0.229026 -0.386959 -0.401663 -0.267873 -0.811856 -0.805692 -0.167269 -0.175806 -0.266781 -0.235192 -0.210249 -0.242684 0.266838 0.234247 0.257710 0.235124 0.226602 0.226551 0.228604 0.230042 0.226048 0.258923 0.243166 0.226201 0.227452 0.228527
chargesum: 0.00000
title: Mulliken charges with hydrogens summed into heavy atoms:
elementType: S C C C C C C C C C C C C C C
charge: 0.219551 0.339388 0.326076 -0.229026 -0.120121 -0.167416 -0.010163 -0.123578 -0.120998 -0.167269 0.083116 -0.023615 -0.008991 0.017202 -0.014157
polarizability: 2.40143413e+02 -3.02309715e+00 1.47627561e+02 -1.70533810e+01 -3.16170791e+00 1.18138990e+02
1716.lowfreq: -17.8781 -6.0512 -0.8769 -0.0006 0.0004 0.0004 3.5157 30.2303 46.8122
frequency: 2.2539 29.9989 46.8119 99.9835 126.2098 148.5431 165.8297 202.6996 221.1537 242.2036 288.9334 306.1818 396.8961 403.4673 405.1445 432.5914 446.1989 472.6225 526.3089 564.1641 610.1363 634.3284 670.3904 693.5680 715.2641 736.0590 745.5398 829.2617 841.7920 862.8823 895.8933 907.8385 956.0657 970.5277 983.4865 987.7812 989.2855 992.0376 1016.6474 1030.8323 1052.9552 1067.1735 1078.3525 1093.2676 1130.8844 1170.6894 1186.4114 1187.3000 1238.8659 1276.6315 1306.1155 1361.6089 1376.1852 1384.1459 1392.2491 1404.5996 1427.5894 1460.0225 1460.7921 1466.1584 1473.0333 1474.2044 1482.4553 1572.1914 1585.3170 1590.9650 1605.3201 2969.8288 2971.1546 3040.9706 3044.8711 3085.6729 3088.1909 3124.0772 3126.3882 3130.9256 3139.8897 3144.1661 3153.6465 3160.2506 3166.0604
redmass: 4.2125 3.7472 4.4080 1.1039 2.6133 1.1668 4.3595 2.9767 5.5907 4.7308 2.5796 4.0066 4.6444 5.2683 4.1856 3.2066 2.9875 3.4083 4.5665 3.7087 6.4385 6.1131 6.8459 2.2757 3.0366 4.3965 1.4892 1.2942 1.2514 5.2349 1.3440 1.3714 1.3354 1.3797 5.9150 1.4883 1.3089 1.5812 3.3406 1.4556 1.6454 2.4370 1.5997 2.1313 1.7303 1.0505 1.2793 1.7908 2.5637 1.2829 1.3268 5.9357 8.1352 3.1416 1.2551 1.2562 2.1856 2.0143 1.0551 1.1453 1.2939 1.1782 1.6000 6.6230 6.2904 5.9681 6.2988 1.0375 1.0383 1.0968 1.0968 1.0984 1.0978 1.0845 1.0889 1.0879 1.0919 1.0928 1.0956 1.0960 1.1015
irintensity: 0.7108 0.2574 0.2247 0.0545 1.0420 0.8192 0.9910 1.8816 0.7762 1.3537 0.2890 0.4056 0.1495 0.3913 1.3728 3.3208 7.1547 14.9375 0.4041 9.5817 0.3944 0.6776 16.8323 32.1572 3.2197 0.2673 76.0637 31.8375 0.8016 12.3087 5.4058 1.2465 0.9346 0.3223 4.6881 17.1483 1.0358 0.8616 25.9018 15.6966 0.0163 17.0390 6.1737 2.1368 14.5571 0.1222 0.4460 3.1760 0.5258 1.6669 1.1928 1.0291 0.8250 3.4694 7.5124 17.9234 8.0086 56.0762 0.2906 24.8123 19.6205 21.3578 35.6193 6.4002 1.0884 51.9222 5.1777 62.2995 10.2369 40.6407 0.4430 36.5428 4.4222 1.9080 19.0196 3.5279 5.0896 16.7909 24.2457 8.2868 24.7076
temp: 298.150 k
press: 1.00000 atm
elementType: 16 6 6 6 6 6 6 6 6 6 6 6 6 6 6 1 1 1 1 1 1 1 1 1 1 1 1 1 1
symmnumber: 1
zpe: 611587.2 jmol-1
zpe.correction: 0.232941 hartree
zpe.thermalcorrener: 0.247413 hartree
zpe.thermalcorrenthalpy: 0.248358 hartree
zpe.thermalcorrgfe: 0.187634 hartree
zpe.sumelectzpe: -938.888755 hartree
zpe.sumelectthermal: -938.874282 hartree
zpe.sumelectthermalent: -938.873338 hartree
zpe.sumelectthermalfe: -938.934062 hartree
dipole: 1.7579 2.0099 -0.4403
dipole: 2.7062
quadrupole: -81.5376 -94.9859 -95.1400
quadrupole: 0.0411 -3.5103 0.7906
quadrupole: 9.0169 -4.4314 -4.5855 0.0411 -3.5103 0.7906
hfenergy: -939.1216958 hartree
pointgroup: C01 [X(C14H14S1)]
dipole: -0.6354719 -0.6791964 -0.5181627 debye
polarizability: 239.2326449|-5.7426973|139.4348767|19.209207|13.6116913|127.2424427 unknown
InChI: InChI=1S/C14H14S/c1-11-8-9-14(10-12(11)2)15-13-6-4-3-5-7-13/h3-10H,1-2H3
charge 0 multiplicity 1
29 atoms
S  0.808691 1.409152 1.420193
C  -2.406073 -0.989011 0.297624
C  -3.242756 -0.070801 -0.413192
C  -0.756143 0.805083 0.651881
C  -1.176541 -0.533246 0.829833
C  -2.810711 1.268372 -0.571047
C  -1.573319 1.714474 -0.051687
C  -2.829718 -2.433508 0.494369
C  -4.574334 -0.5192 -0.987252
C  2.103977 0.469207 0.495715
C  1.885845 -0.081024 -0.788631
C  3.373655 0.354395 1.113875
C  2.940346 -0.752095 -1.448851
C  4.424355 -0.307729 0.440036
C  4.212802 -0.866867 -0.842094
H  -0.536823 -1.226577 1.387152
H  -3.448245 1.975433 -1.11496
H  -1.246285 2.749212 -0.194138
H  -2.080818 -2.994084 1.078374
H  -3.797789 -2.504479 1.026581
H  -2.961679 -2.95331 -0.474309
H  -5.257947 -0.880032 -0.194414
H  -5.079388 0.305578 -1.517695
H  -4.449616 -1.355969 -1.701266
H  0.906042 0.011574 -1.26827
H  3.537967 0.772095 2.113557
H  2.76513 -1.178213 -2.443342
H  5.404152 -0.392221 0.923583
H  5.027222 -1.385209 -1.359726
