program: Gaussian 09
title: 000137731
version: EM64L-G09RevD.01
frameworkgroup: C1[X(C12H12O2)]
method: RPBEPBE
basis: SDD
operation: Freq
keyword: #pfreq=noraman
keyword: PBEPBE/SDD
title: #p freq=noraman PBEPBE/SDD
converged: YES YES NO YES
title: Mulliken charges:
elementType: O O C C C C C C C C C C C C H H H H H H H H H H H H
charge: -0.194632 -0.194638 -0.214410 -0.214553 -0.215569 -0.215466 -0.476168 -0.476124 -0.224748 -0.224766 0.090665 0.091129 -0.256729 -0.257011 0.264465 0.264530 0.271517 0.271477 0.237393 0.217365 0.217372 0.237341 0.239151 0.239155 0.261626 0.261630
chargesum: 0.00000
title: Mulliken charges with hydrogens summed into heavy atoms:
elementType: O O C C C C C C C C C C C C
charge: -0.194632 -0.194638 0.050055 0.049977 0.055948 0.056010 -0.021410 -0.021412 0.014403 0.014388 0.090665 0.091129 0.004897 0.004619
polarizability: 1.21546045e+02 9.79755628e-03 1.46526116e+02 -7.01982089e+00 4.26237161e-03 9.13933728e+01
1716.lowfreq: -11.1869 -0.0006 -0.0001 0.0005 4.4120 15.5782 35.9740 47.4438 150.0468
frequency: 35.2634 47.4292 150.0468 187.2825 225.7904 248.3318 302.3438 356.5833 364.2926 404.0353 438.4400 482.2588 512.4753 550.7070 607.1102 636.1635 640.4446 702.6730 711.0714 711.1035 752.1239 810.7775 829.1356 861.4072 877.9887 893.4050 908.3457 950.4148 958.1417 970.4113 986.8409 1012.1016 1020.0114 1044.7771 1063.1399 1077.5785 1098.4685 1127.9157 1152.4430 1169.2834 1187.4238 1196.4017 1222.3051 1235.7545 1244.2129 1262.3214 1290.9342 1304.5698 1306.2117 1318.6642 1322.4955 1351.2310 1360.9935 1368.2914 1463.1294 1478.1763 1559.7660 1570.8972 1622.1352 1624.9704 2975.3180 2984.4971 2994.3482 3001.4519 3045.4618 3063.0614 3065.9672 3069.8586 3125.7465 3132.8109 3152.0890 3164.4223
redmass: 4.3405 6.2976 4.9128 3.9330 2.0931 4.2179 4.0912 4.6655 2.6767 8.0974 6.5389 4.5734 3.9827 3.6985 4.9533 4.0218 4.7108 3.1656 3.0312 1.7845 5.3582 1.3747 3.8618 2.8375 1.9517 3.0371 2.8252 1.3778 2.5780 2.8567 3.2774 2.0453 1.3249 2.5755 2.9088 1.9889 1.4916 1.0775 1.1670 1.1650 1.3515 1.2329 1.2252 1.9896 1.3829 1.6484 1.9789 1.4121 1.2866 1.4915 1.4683 1.5580 1.9108 2.0337 1.0789 1.0906 11.5467 9.3511 6.9739 6.0765 1.0824 1.0614 1.0832 1.0636 1.1010 1.0866 1.0906 1.1002 1.0862 1.0864 1.0998 1.1052
irintensity: 0.0416 14.0265 1.8381 0.1061 0.3056 0.0035 4.7892 0.7538 0.3090 15.1614 6.8835 0.5559 0.0165 6.5373 0.0001 1.8947 0.1360 1.2684 9.0269 41.1843 0.6311 5.8120 3.1823 5.0960 30.6160 4.9862 13.3773 0.3039 6.6648 0.3319 1.9758 0.0140 0.0184 47.6776 0.1665 0.4021 47.7139 1.2724 30.4184 8.4077 0.0123 12.0773 1.5674 8.4027 2.6904 18.6594 63.4516 0.2329 0.6139 0.3929 5.0056 2.4123 8.7789 0.1779 3.8034 8.7156 23.9047 248.8670 8.9521 2.3270 7.4460 28.9140 11.2198 62.9166 0.4775 27.1285 11.1913 42.6329 0.4504 4.1908 14.5426 22.7450
temp: 298.150 k
press: 1.00000 atm
elementType: 8 8 6 6 6 6 6 6 6 6 6 6 6 6 1 1 1 1 1 1 1 1 1 1 1 1
symmnumber: 1
zpe: 549950.1 jmol-1
zpe.correction: 0.209465 hartree
zpe.thermalcorrener: 0.220416 hartree
zpe.thermalcorrenthalpy: 0.221360 hartree
zpe.thermalcorrgfe: 0.172055 hartree
zpe.sumelectzpe: -613.870021 hartree
zpe.sumelectthermal: -613.859070 hartree
zpe.sumelectthermalent: -613.858126 hartree
zpe.sumelectthermalfe: -613.907431 hartree
dipole: 1.2357 -0.0002 -0.0243
dipole: 1.2360
quadrupole: -75.6200 -100.2997 -77.4289
quadrupole: -0.0099 -2.7625 -0.0044
quadrupole: 8.8295 -15.8502 7.0206 -0.0099 -2.7625 -0.0044
hfenergy: -614.0794862 hartree
pointgroup: C01 [X(C12H12O2)]
dipole: 0.4857134 0.0002505 -0.0233325 debye
dipolederiv: -0.5310501 0.0016686 0.0283242 0.1808653 -0.8942485 0.0376204 0.0620774 0.0374073 -0.3362994 -0.5309642 -0.0015881 0.028373 -0.1803896 -0.8942134 -0.0376208 0.0617346 -0.0382363 -0.3364342 -0.4484813 0.1073374 0.0556517 0.0011341 -0.0364844 -0.0178244 0.0687435 -0.0544101 0.0632282 -0.4481758 -0.1074617 0.0556527 -0.0015875 -0.0365114 0.0175345 0.0688791 0.0545651 0.0629834 0.2385963 -0.0153994 0.042735 0.1167174 0.1228876 -0.0341488 0.100155 -0.035935 -0.0090085 0.2385872 0.0154536 0.0425989 -0.1166385 0.12289 0.0343 0.0997399 0.0360529 -0.0090699 0.04116 0.0758208 0.0075893 -0.0093032 0.0188815 0.0178921 0.0012563 0.0020773 0.1091971 0.0412287 -0.0757811 0.0075148 0.0093056 0.0187745 -0.0180142 0.0013398 -0.002155 0.1092077 -0.2953861 -0.0049838 -0.0112315 -0.0432231 -0.0121262 -0.0491266 0.0153351 0.0157388 0.1239593 -0.2955202 0.0046583 -0.0113436 0.0429364 -0.0121602 0.0489882 0.015476 -0.0158144 0.1240046 0.8753646 0.1798291 -0.1566543 -0.1730436 0.9354445 -0.0687303 -0.3249707 -0.1028968 0.2132333 0.8755873 -0.1797768 -0.1566927 0.1732699 0.9351924 0.0691043 -0.3246339 0.1029474 0.2136341 -0.1092836 -0.2551631 -0.0001652 -0.2635991 -0.1501816 0.1178849 0.0411369 0.114955 -0.0772308 -0.1099739 0.2552902 -0.0000595 0.2634782 -0.1495169 -0.1180618 0.0412332 -0.1145165 -0.0773555 0.07609 0.0086891 0.0196884 0.0274918 0.0179274 0.0357844 0.0119472 0.0725623 -0.0798258 0.07601 -0.0088102 0.0196083 -0.0275823 0.0179738 -0.0356437 0.011935 -0.0724189 -0.0798707 0.054752 0.032381 0.0047287 -0.0196141 -0.1024115 -0.0031321 -0.0063737 -0.0137972 0.0561067 0.0546837 -0.032228 0.0047044 0.0197712 -0.1025807 0.0029883 -0.006403 0.0136448 0.0561258 -0.1262445 -0.0720888 -0.0508485 -0.0517628 0.0131209 -0.015909 -0.0831518 -0.0608182 0.0445618 0.0711515 0.0025883 -0.0041943 -0.008265 0.0163212 0.059957 0.0503635 0.1149458 -0.1525465 0.0711563 -0.0025596 -0.0041734 0.0082259 0.0165265 -0.0597453 0.0504396 -0.1146929 -0.15275 -0.1264144 0.0720412 -0.050738 0.0517577 0.0131672 0.015813 -0.0831223 0.0606849 0.0446836 0.1813174 0.012158 0.0065223 0.0001545 0.0234385 -0.0864472 -0.0076075 -0.0574372 -0.074202 0.1814003 -0.011975 0.0064335 0.0000278 0.0232802 0.0865589 -0.0076695 0.0575461 -0.0740616 -0.0278464 0.0258494 0.0579756 0.0718642 0.0473527 -0.0283348 0.0711152 -0.0094088 0.1188652 -0.0277447 -0.0259495 0.0580002 -0.0719913 0.0472558 0.028313 0.0710251 0.0094096 0.1188642 unknown
polarizability: 121.1238964|-0.0027165|146.5261058|-7.8631145|0.0256783|91.8155312 unknown
InChI: InChI=1S/C12H12O2/c13-9-5-6-10(14)12-8-2-1-7(3-4-8)11(9)12/h1-2,5-8,11-12H,3-4H2
charge 0 multiplicity 1
26 atoms
O  -1.341348 2.752292 -0.238618
O  -1.339799 -2.753313 -0.241852
C  -0.006889 0.782251 -0.749867
C  -0.006234 -0.781926 -0.750324
C  1.251587 1.301648 0.060194
C  1.253002 -1.300687 0.05894
C  2.52324 0.783437 -0.68625
C  2.523967 -0.780321 -0.687206
C  1.218791 0.681191 1.446619
C  1.219671 -0.681625 1.445961
C  -1.265785 1.485201 -0.233145
C  -1.264237 -1.486238 -0.233231
C  -2.404568 0.682739 0.275859
C  -2.404005 -0.684985 0.275481
H  0.122978 1.148205 -1.788422
H  0.123488 -1.147136 -1.78917
H  1.221891 2.403402 0.083304
H  1.224539 -2.402492 0.080995
H  3.421674 1.176097 -0.178684
H  2.529598 1.18188 -1.718945
H  2.530477 -1.177503 -1.720384
H  3.422893 -1.172726 -0.180314
H  1.198047 1.297129 2.351757
H  1.199677 -1.298462 2.350502
H  -3.260574 1.260397 0.647054
H  -3.259582 -1.263553 0.646248
