program: Gaussian 09
title: 000137724
version: EM64L-G09RevD.01
frameworkgroup: C1[X(C8H14)]
method: RPBEPBE
basis: SDD
operation: Freq
keyword: #p
keyword: freq=noraman
keyword: PBEPBE/SDD
title: #p freq=noraman PBEPBE/SDD
converged: YES YES NO NO
title: Mulliken charges:
elementType: C C C C C C C C H H H H H H H H H H H H H H
charge: -0.059740 -0.443842 -0.429907 -0.381603 -0.430284 -0.215139 -0.213768 -0.711955 0.193046 0.204613 0.193479 0.202641 0.207384 0.211588 0.195471 0.210033 0.210065 0.211219 0.197993 0.228123 0.205314 0.215269
chargesum: 0.00000
title: Mulliken charges with hydrogens summed into heavy atoms:
elementType: C C C C C C C C
charge: 0.133305 -0.045750 -0.019881 0.025456 -0.010187 -0.003920 -0.015775 -0.063249
polarizability: 1.00494463e+02 -2.25784210e+00 7.90185932e+01 4.97610921e+00 -8.18465822e-01 6.66225651e+01
1716.lowfreq: -10.7074 -0.0007 -0.0006 -0.0003 21.9230 32.1099 81.5925 105.0922 186.3345
frequency: 81.5822 104.8756 186.2944 237.5168 269.0676 301.7346 383.1116 446.8794 486.8991 541.3674 693.7713 726.1276 740.7406 811.8761 836.5590 875.7565 908.5206 922.7919 979.5735 985.5747 1016.4496 1045.1763 1055.8968 1084.7389 1104.5283 1117.7890 1139.2650 1178.0726 1235.1442 1246.4810 1256.0941 1285.8101 1314.0835 1328.1449 1331.3548 1336.1419 1352.7648 1388.1344 1391.0858 1454.5119 1463.5507 1467.0259 1472.9756 1479.0978 1487.5756 1669.0410 2937.8989 2949.7286 2966.8832 2974.7717 2975.5080 2982.6564 3003.9290 3024.1685 3029.8057 3044.9852 3067.6101 3077.9994 3085.2366 3118.1541
redmass: 2.4141 1.8817 2.5571 1.2166 1.9290 2.0945 2.3436 2.4029 2.5709 3.5868 1.5764 1.5065 1.9005 1.5460 2.3488 1.5703 2.2716 1.9994 2.2965 1.2686 1.4755 1.6639 2.6254 1.6345 1.5908 1.7366 1.0838 1.5426 1.2252 1.2687 1.2380 1.3467 1.3177 1.4402 1.6026 1.4123 1.5327 1.4485 1.2979 1.0881 1.0796 1.0851 1.0892 1.0445 1.0548 6.6756 1.0805 1.0634 1.0592 1.0460 1.0523 1.0670 1.0912 1.1003 1.0998 1.1033 1.0991 1.0986 1.0848 1.0984
irintensity: 0.0387 0.3253 0.0179 0.1137 0.1668 0.5457 0.5420 4.3863 2.1418 2.0658 20.0365 22.3304 6.9803 7.1384 2.0897 11.7231 9.0872 5.5294 5.6974 0.2694 4.9513 0.6296 0.2814 1.4485 2.1070 5.0788 0.4254 2.4021 0.5223 0.3818 0.4657 0.7420 0.4035 3.4561 0.4733 0.4756 0.7119 6.2206 10.3256 8.3531 1.4391 10.4762 11.5794 10.2343 10.2139 3.5138 26.1887 42.6455 37.9230 42.0795 42.4773 27.4983 42.2874 27.4700 53.8413 71.8338 59.1541 63.6116 2.6784 58.6473
temp: 298.150 k
press: 1.00000 atm
elementType: 6 6 6 6 6 6 6 6 1 1 1 1 1 1 1 1 1 1 1 1 1 1
symmnumber: 1
zpe: 523132.3 jmol-1
zpe.correction: 0.199251 hartree
zpe.thermalcorrener: 0.207627 hartree
zpe.thermalcorrenthalpy: 0.208572 hartree
zpe.thermalcorrgfe: 0.166509 hartree
zpe.sumelectzpe: -312.586150 hartree
zpe.sumelectthermal: -312.577773 hartree
zpe.sumelectthermalent: -312.576829 hartree
zpe.sumelectthermalfe: -312.618891 hartree
dipole: -0.0996 -0.3240 -0.0338
dipole: 0.3407
quadrupole: -49.4781 -50.3986 -51.7168
quadrupole: -0.1984 0.9351 -0.2564
quadrupole: 1.0531 0.1326 -1.1856 -0.1984 0.9351 -0.2564
hfenergy: -312.7854005 hartree
pointgroup: C01 [X(C8H14)]
dipole: -0.0376168 -0.1278305 -0.0143726 debye
dipolederiv: 0.0163363 0.0318704 -0.0055106 -0.0357254 -0.0070421 -0.0269165 0.0328011 -0.0144765 0.1948944 0.01117 -0.0073231 -0.0437446 -0.0059397 0.0971874 0.0065839 -0.0212604 0.0108411 0.0956565 0.0647293 0.0265609 -0.0512865 0.0327946 0.0758145 -0.0060694 -0.059646 0.0108175 0.0751359 0.1219092 -0.0556138 0.030225 -0.0065813 0.0884951 -0.0121977 -0.0183591 -0.0008739 0.099479 -0.0037345 -0.0370855 -0.0703312 -0.0102439 -0.0283413 -0.0210561 -0.0218178 -0.02215 0.2000291 -0.0399246 -0.0301854 0.1037507 -0.1002322 0.1458429 0.0058729 0.1294266 -0.024871 -0.2323993 0.0911897 0.0662264 0.1205905 0.1299374 0.1178186 0.0250231 0.0935855 0.0179089 -0.2180485 -0.0386404 -0.0697555 0.0314939 -0.0381076 0.0224799 -0.0051252 0.0456849 0.0085646 0.0841417 -0.0362372 -0.0016098 -0.1179876 0.0378769 0.0203192 0.0020395 -0.1127357 0.007378 -0.1442549 -0.0540612 -0.0384518 0.1123214 -0.0100787 0.0740763 -0.0275446 0.0914074 0.0227754 -0.1394041 0.0139875 0.1232385 -0.0222889 0.0945256 -0.1841573 0.0134486 -0.0151909 -0.0240129 0.0656591 -0.0922479 -0.1472452 -0.0357522 -0.1402629 -0.1022858 -0.0300176 -0.0195878 -0.009819 0.0750349 0.0218435 0.0509348 0.1211464 0.026362 0.0476742 0.0186043 0.0880814 -0.0148597 -0.1318675 0.000057 -0.0224421 -0.1068865 -0.0216169 0.0599183 -0.0053838 -0.0677011 -0.0347794 -0.1328028 -0.0248651 0.061348 0.0099347 0.0955751 -0.2018163 0.0340759 0.0100418 0.0491052 0.0614656 -0.0918355 -0.001743 0.0994537 -0.0800199 0.0421756 -0.0146765 0.1579662 -0.0140979 -0.0336327 -0.0040214 0.0382942 -0.1012651 0.0177121 0.0228568 0.0548806 -0.1692391 0.057509 -0.0961443 -0.0076998 -0.1170129 -0.0643244 -0.0979992 -0.1017669 -0.0252808 -0.0728209 -0.0201306 0.122979 0.0385634 0.0548212 -0.0341706 0.0564438 -0.1844503 -0.0021629 -0.0525149 0.0094668 0.1409899 0.0935115 0.0704705 -0.0339068 0.0209547 -0.1418633 0.0647517 -0.0361862 0.0541753 0.0698596 0.0409126 -0.0235082 -0.0640898 -0.0237174 0.0710006 0.0033498 -0.1407771 -0.023282 -0.1468617 -0.1209426 0.0282111 0.1226285 0.0583429 0.066064 -0.0521993 0.1588423 -0.0451889 -0.0099089 unknown
polarizability: 100.590234|-2.0312581|78.9774354|4.8239848|-0.6259969|66.5679515 unknown
InChI: InChI=1S/C8H14/c1-2-8-6-4-3-5-7-8/h4,6,8H,2-3,5,7H2,1H3
charge 0 multiplicity 1
22 atoms
C  0.627038 -0.259036 0.63271
C  -0.518276 -1.310224 0.620739
C  -1.524186 -1.053602 -0.526833
C  1.742448 -0.60161 -0.404817
C  -2.199551 0.328376 -0.362291
C  0.066991 1.144374 0.439696
C  -1.196937 1.406612 0.010456
C  2.951592 0.358296 -0.370135
H  1.114743 -0.290457 1.632305
H  -1.063402 -1.265172 1.585089
H  -0.090109 -2.32857 0.53757
H  -2.290395 -1.851772 -0.553213
H  -0.992877 -1.086571 -1.498084
H  1.304075 -0.605431 -1.422106
H  2.090959 -1.635223 -0.202254
H  -2.988212 0.275786 0.419109
H  -2.723548 0.613167 -1.297068
H  0.733962 1.984627 0.678912
H  -1.530996 2.450957 -0.074808
H  2.66287 1.381712 -0.669373
H  3.386756 0.412322 0.646407
H  3.746956 0.019238 -1.058913
