program: Gaussian 09
title: 000137697
version: EM64L-G09RevD.01
frameworkgroup: C1[X(C9H8F3NO)]
method: RPBEPBE
basis: SDD
operation: Freq
keyword: #p
keyword: freq=noraman
keyword: PBEPBE/SDD
title: #p freq=noraman PBEPBE/SDD
converged: NO YES NO NO
title: Mulliken charges:
elementType: F F F O N C C C C C C C C C H H H H H H H H
charge: -0.184066 -0.136983 -0.137160 -0.202249 -0.457923 0.525377 0.491501 -0.605430 -0.357226 -0.410211 -0.204705 -0.805052 0.136810 0.298995 0.228544 0.304972 0.236939 0.349084 0.231788 0.226280 0.240974 0.229741
chargesum: 0.00000
title: Mulliken charges with hydrogens summed into heavy atoms:
elementType: F F F O N C C C C C C C C C
charge: -0.184066 -0.136983 -0.137160 -0.202249 -0.108839 0.525377 0.491501 -0.376886 -0.052254 -0.173272 0.027084 -0.108057 0.136810 0.298995
polarizability: 1.68038543e+02 9.21773884e+00 1.14791196e+02 -2.43493879e-01 -1.90605875e-01 5.58132287e+01
1716.lowfreq: -5.5491 -0.0009 -0.0007 -0.0005 7.0052 10.6941 17.0614 48.5284 50.6738
frequency: 15.1480 48.2018 50.5428 78.6878 106.6231 207.2365 214.5817 222.7349 244.9808 294.5637 297.5529 370.1951 409.7465 433.6677 448.0458 494.0709 514.4943 565.5361 582.7041 647.9425 695.0587 700.7353 723.8529 736.7258 807.5331 849.0560 879.4844 913.5101 927.6383 986.8642 997.8599 1000.8279 1008.8846 1038.8448 1048.3467 1097.1167 1104.2422 1186.7048 1189.3894 1224.9917 1281.5478 1321.0388 1387.1667 1399.7072 1418.5828 1471.5601 1475.9431 1488.6644 1542.1637 1605.3100 1623.3747 1647.8429 2980.3076 3062.3876 3091.2028 3106.0427 3131.4918 3155.7171 3198.9754 3505.9489
redmass: 11.2637 4.4616 1.1113 5.6556 6.3915 3.9554 4.9225 8.4791 5.5951 8.8361 6.0975 6.5813 4.6587 5.4432 4.2448 12.6295 5.2761 3.4374 8.9925 11.6286 4.5601 2.3442 1.3363 6.7201 1.3831 7.8411 1.4180 3.3707 1.3905 6.1938 1.3327 1.7041 7.0720 12.4218 1.5694 4.1841 1.6444 2.0045 1.1195 2.9330 2.8156 1.4207 8.2988 1.2255 2.3542 1.3157 1.0615 2.0061 1.9515 4.6003 5.9287 9.4019 1.0387 1.0952 1.0997 1.0915 1.0880 1.0957 1.0954 1.0765
irintensity: 0.0393 0.7588 0.6262 1.7809 0.3814 10.0393 1.2213 8.2044 0.5553 3.5596 0.5655 1.6393 1.0953 11.7469 0.6013 12.2468 1.2401 2.6757 27.0670 4.7090 5.0281 24.5703 61.7946 5.8189 61.8027 45.9336 17.4619 8.2166 8.6856 1.9611 0.5238 20.6042 163.9731 256.5891 23.6163 208.4749 7.3878 55.6548 8.3626 36.2799 2.2298 6.0689 9.2248 13.3078 23.6391 21.1105 15.9322 83.6844 116.3305 5.9574 64.5332 315.7326 28.7351 20.2410 14.4791 16.1352 7.8342 19.0580 4.1746 45.2595
temp: 298.150 k
press: 1.00000 atm
elementType: 9 9 9 8 7 6 6 6 6 6 6 6 6 6 1 1 1 1 1 1 1 1
symmnumber: 1
zpe: 408284.9 jmol-1
zpe.correction: 0.155507 hartree
zpe.thermalcorrener: 0.168602 hartree
zpe.thermalcorrenthalpy: 0.169546 hartree
zpe.thermalcorrgfe: 0.113491 hartree
zpe.sumelectzpe: -776.250439 hartree
zpe.sumelectthermal: -776.237345 hartree
zpe.sumelectthermalent: -776.236401 hartree
zpe.sumelectthermalfe: -776.292456 hartree
dipole: -4.7447 -2.6042 0.0438
dipole: 5.4126
quadrupole: -79.7512 -77.6847 -83.6023
quadrupole: -1.9752 -0.2866 -0.0978
quadrupole: 0.5949 2.6614 -3.2562 -1.9752 -0.2866 -0.0978
hfenergy: -776.4059467 hartree
pointgroup: C01 [X(C9H8F3N1O1)]
dipole: -1.8709523 -1.0169031 0.0127872 debye
dipolederiv: -0.5341971 0.0218614 -0.0003116 0.0804341 -0.8641971 -0.0071641 -0.0001351 -0.0067655 -0.2945179 -0.6980828 -0.0257569 0.2717214 0.0135014 -0.28387 0.0705863 0.2807934 0.0963107 -0.6289588 -0.6932418 -0.0180224 -0.2704512 0.0212446 -0.280442 -0.062604 -0.2818424 -0.0883468 -0.6382801 -0.6207921 0.0201502 0.0000712 -0.7344349 -0.8254347 -0.0049826 -0.0099407 -0.0057481 -0.3032378 -1.2951878 -0.2168347 -0.0046129 -0.2609119 -0.4469237 -0.0020988 -0.0045558 -0.0031701 -0.2866389 0.800676 -0.048083 -0.0011178 -0.2504351 0.1246723 0.0021319 0.0020235 0.0068812 0.1116101 0.2345354 0.1887126 -0.0116983 0.3166935 0.2374591 -0.0136336 -0.0630319 -0.0538296 -0.0091976 -0.2709755 -0.1176699 0.0029502 -0.0676686 -0.0032307 -0.0043778 0.0103825 0.0012131 -0.2153908 -0.1967848 0.0211647 0.0032724 0.0708192 -0.1364602 0.0030038 0.0017726 -0.0002202 -0.1716079 -0.0348179 -0.0734544 -0.0053295 -0.1605157 -0.185531 0.0052309 -0.0001675 0.0079787 -0.1813574 0.0361894 -0.0340151 0.0024005 -0.0745713 0.1676381 -0.0034347 0.0063973 0.0048214 -0.1282442 -0.0369928 -0.1067999 0.0074916 -0.11395 -0.0436619 0.0123185 0.0836976 0.076765 0.0575004 1.0569686 0.2168208 0.0038023 1.1073792 1.0416856 0.0097099 0.016495 0.0087074 0.1003389 1.8839116 0.0971955 -0.0003052 -0.077921 1.302259 -0.0020822 -0.0006722 -0.0018379 1.5804719 0.0564421 0.0769444 -0.0026947 0.0719089 -0.0839243 -0.0029604 -0.0019027 -0.0071304 0.1624063 0.1102733 -0.061436 -0.000872 -0.0377914 0.082942 -0.0006519 -0.0013687 -0.0016459 0.1860365 -0.1158058 0.0442295 -0.0014453 0.029189 0.0869431 -0.0034081 -0.0073582 -0.001898 0.1577157 0.2530782 -0.0577012 -0.000664 -0.0054992 0.1842569 -0.0012429 0.0008315 -0.0012659 0.3133977 0.0588541 0.0446105 -0.0011702 0.0616281 -0.0932133 -0.0010023 -0.0025547 -0.0016055 0.151914 0.0452424 0.0840227 0.0595782 -0.0008517 -0.0745494 -0.0871747 0.0023135 -0.1087603 0.059083 0.0478258 -0.0621486 0.0322996 -0.0751586 0.0447719 0.0429279 0.0720375 0.0761127 -0.0924078 -0.0871184 0.0062099 -0.0829145 0.0869115 0.0488103 0.050909 -0.1032147 0.003434 0.0693646 unknown
polarizability: 168.1140938|8.9980348|114.7165132|-0.1340655|-0.0050292|55.8123611 unknown
InChI: InChI=1S/C9H8F3NO/c1-6-3-2-4-7(5-6)13-8(14)9(10,11)12/h2-5,13H,1H3
charge 0 multiplicity 1
22 atoms
F  2.784025 -1.800701 -0.017354
F  3.798411 -0.091608 -1.123311
F  3.785402 -0.118395 1.140329
O  1.760524 1.696955 0.016343
N  0.56739 -0.353387 -0.005742
C  -0.798839 0.066705 -0.003277
C  -3.160684 -0.640269 -0.014427
C  -1.783044 -0.955386 -0.015363
C  -1.180624 1.432302 0.006002
C  -3.537848 0.728212 -0.009618
C  -2.556671 1.743253 0.002329
C  -4.208204 -1.739334 0.005059
C  1.691644 0.439999 0.002578
C  3.012739 -0.384511 0.000588
H  -1.472974 -2.009543 -0.02609
H  -0.421711 2.216123 0.012577
H  -4.60107 0.994371 -0.01603
H  0.724744 -1.36628 -0.014334
H  -2.86366 2.794699 0.004898
H  -3.859581 -2.646598 -0.518688
H  -4.454532 -2.032668 1.043828
H  -5.146138 -1.40874 -0.473296
