program: Gaussian 09
title: 000137688
version: EM64L-G09RevD.01
frameworkgroup: C1[X(C8H12O)]
method: RPBEPBE
basis: SDD
operation: Freq
keyword: #pfreq=noraman
keyword: PBEPBE/SDD
title: #p freq=noraman PBEPBE/SDD
converged: NO YES NO NO
title: Mulliken charges:
elementType: O C C C C C C C C H H H H H H H H H H H H
charge: -0.200699 -0.075113 -0.215823 -0.458056 -0.457882 -0.455280 -0.455507 -0.528333 0.124481 0.210432 0.250595 0.211598 0.220835 0.220796 0.211570 0.233001 0.220148 0.220161 0.233046 0.245018 0.245009
chargesum: 0.00000
title: Mulliken charges with hydrogens summed into heavy atoms:
elementType: O C C C C C C C C
charge: -0.200699 0.135319 0.034772 -0.025622 -0.025516 -0.002130 -0.002300 -0.038306 0.124481
polarizability: 8.58770937e+01 -2.80661392e-01 7.80751697e+01 3.66839346e-03 -5.94577289e-03 7.40696348e+01
1716.lowfreq: -26.6810 0.0009 0.0009 0.0011 3.9013 21.3925 66.5504 138.8567 253.2382
frequency: 65.5942 138.7977 253.1991 328.8234 342.2660 427.4192 475.5822 484.1741 589.6624 592.7651 724.1230 792.0576 793.7255 820.4822 856.1221 860.2527 878.7099 938.0237 952.9426 972.4308 1051.6973 1059.6924 1071.7145 1076.0257 1105.8007 1114.0699 1154.5750 1213.6496 1217.2625 1228.8618 1237.5910 1274.6494 1288.0113 1295.4021 1313.3955 1321.3226 1331.1462 1344.1801 1349.2544 1424.3248 1464.3319 1474.2179 1478.0593 1494.0529 1637.6519 2980.5675 2982.1331 2983.1882 2996.2123 2998.9160 3020.2723 3031.4511 3034.1842 3037.2307 3051.9039 3058.0814 3063.4007
redmass: 2.8448 2.3223 1.7289 1.9609 2.5302 5.0033 4.2041 4.3450 2.4113 5.8826 4.2271 1.2459 2.7190 1.6866 2.0352 2.5287 1.8151 4.1274 1.9895 2.3255 2.3990 2.0541 2.3612 1.6920 1.4074 1.0512 1.0308 1.3826 1.5011 1.1481 1.5422 1.5826 1.8082 1.5582 1.2982 1.5668 1.6038 1.4786 1.3891 1.0811 1.0737 1.0786 1.0873 1.0923 10.4922 1.0614 1.0600 1.0588 1.0645 1.0621 1.0833 1.1039 1.1030 1.1000 1.0873 1.1042 1.1036
irintensity: 3.9014 0.7706 0.0964 0.2567 0.8082 9.7934 2.5113 0.4067 0.0914 2.4961 1.2839 1.7978 3.2936 6.6969 10.8111 1.0295 4.5190 2.3151 0.1798 5.9803 4.1506 0.7451 0.0723 20.4088 12.3741 0.0144 0.0726 6.5804 1.8172 0.0133 15.3700 1.6458 3.2664 0.5052 0.0505 10.8546 7.0520 0.0448 2.4955 19.7319 0.0805 10.8342 14.7792 2.7911 197.6744 22.3185 29.2376 4.3787 47.9454 82.6908 79.6593 0.2926 4.3595 6.2843 26.8130 42.6869 74.7298
temp: 298.150 k
press: 1.00000 atm
elementType: 8 6 6 6 6 6 6 6 6 1 1 1 1 1 1 1 1 1 1 1 1
symmnumber: 1
zpe: 481769.9 jmol-1
zpe.correction: 0.183496 hartree
zpe.thermalcorrener: 0.191137 hartree
zpe.thermalcorrenthalpy: 0.192081 hartree
zpe.thermalcorrgfe: 0.151282 hartree
zpe.sumelectzpe: -386.572146 hartree
zpe.sumelectthermal: -386.564505 hartree
zpe.sumelectthermalent: -386.563561 hartree
zpe.sumelectthermalfe: -386.604361 hartree
dipole: -3.7127 0.0565 -0.0008
dipole: 3.7131
quadrupole: -66.0279 -51.8369 -52.7347
quadrupole: 0.0849 -0.0012 -0.0022
quadrupole: -9.1614 5.0296 4.1318 0.0849 -0.0012 -0.0022
hfenergy: -386.7556426 hartree
pointgroup: C01 [X(C8H12O1)]
dipole: -1.4608423 -0.0011275 0.0004055 debye
dipolederiv: -1.0825084 0.0126178 0.0004187 -0.0076971 -0.4927076 0.0005189 -0.0000286 0.0005001 -0.286312 0.1137605 -0.017393 -0.0000432 -0.050514 0.1177182 -0.0000874 0.0001867 -0.0000712 0.0919047 -0.2226727 -0.176036 0.0007246 -0.2089306 -0.1068094 0.0005562 0.0008951 0.0006492 0.0264104 0.1054605 0.0064685 0.0157434 0.0151133 0.0381269 0.0566885 -0.0065497 0.0711788 0.0385945 0.1054172 0.0062022 -0.0158637 0.0150259 0.0375817 -0.056648 0.0063231 -0.0712212 0.0393365 0.1108587 0.0436861 0.0362768 -0.0260695 0.0628681 0.0031209 -0.0042533 -0.0536672 0.0926781 0.110588 0.0435826 -0.0366488 -0.0259305 0.0631841 -0.0030126 0.004174 0.0536323 0.0923736 -0.0895599 0.1207588 -0.0002727 0.2244182 -0.3232792 0.0010218 -0.0006826 0.0010191 0.087004 1.2052171 -0.0356311 -0.0004594 0.0884976 0.8778943 -0.0024135 -0.0004393 -0.0022062 0.0095133 -0.0430665 0.1230121 -0.0002242 0.1328345 -0.1436566 0.0003182 -0.0002243 0.0003281 0.0423436 -0.0315928 0.1170132 -0.0002146 0.0869688 -0.0867451 0.0001979 -0.0001754 0.0001774 0.0418968 -0.1942269 -0.0254651 0.0465289 -0.0617715 0.0280326 0.0138029 -0.0085428 0.0114291 0.0721987 0.0632694 -0.0187949 -0.0577939 0.0236603 -0.0303343 -0.1185762 -0.0087287 -0.1033111 -0.1273486 0.0635143 -0.0180249 0.0570374 0.024224 -0.0291777 0.1180839 0.0077904 0.102863 -0.128806 -0.1942475 -0.0259156 -0.0453968 -0.0620323 0.0277646 -0.0134345 0.009842 -0.0111076 0.0724461 -0.0009745 0.0541596 -0.1147784 0.0159965 0.0513281 -0.0039003 -0.0819368 0.0335423 -0.1192629 -0.0346527 -0.1270445 0.0331567 -0.078456 -0.1181985 0.0278834 0.0186918 -0.011209 0.0709965 -0.0344902 -0.1270358 -0.0325082 -0.0785522 -0.1185186 -0.0272045 -0.0182474 0.0120706 0.0711725 -0.0007779 0.0544886 0.1144087 0.0162564 0.0512939 0.0034732 0.0818247 -0.034128 -0.1194015 0.0251422 -0.0056021 -0.0524784 -0.0217831 0.0462292 -0.0671863 -0.0623321 -0.1233804 -0.0331502 0.025542 -0.0050465 0.052387 -0.0212587 0.0474052 0.0667977 0.0624131 0.1229118 -0.0345882 unknown
polarizability: 85.8840768|-0.1557218|78.0681706|-0.0017355|-0.0100694|74.0696508 unknown
InChI: InChI=1S/C8H12O/c9-8-5-6-1-3-7(8)4-2-6/h6-7H,1-5H2
charge 0 multiplicity 1
21 atoms
O  2.561035 0.149056 -0.001766
C  -1.042602 1.07409 -0.001928
C  0.435995 -1.105311 0.001826
C  -1.352119 0.231567 1.266392
C  -1.355496 0.224815 -1.264939
C  -0.47124 -1.065366 1.270159
C  -0.473256 -1.071174 -1.265185
C  0.462135 1.439237 -0.004703
C  1.301497 0.153022 -0.001919
H  -1.656173 1.995331 -0.003544
H  1.085124 -1.998689 0.003368
H  -2.42756 -0.028236 1.281032
H  -1.156781 0.836477 2.171901
H  -1.164114 0.825252 -2.174254
H  -2.430722 -0.036167 -1.274369
H  0.155122 -1.117469 2.17948
H  -1.105902 -1.971784 1.266107
H  -1.106892 -1.978268 -1.257029
H  0.151895 -1.125864 -2.175205
H  0.741497 2.045992 0.879528
H  0.739358 2.040687 -0.893254
