program: Gaussian 09
title: 000137678
version: EM64L-G09RevD.01
frameworkgroup: C1[X(C3H6N2)]
method: RPBEPBE
basis: SDD
operation: Freq
keyword: #p
keyword: freq=noraman
keyword: PBEPBE/SDD
title: #p freq=noraman PBEPBE/SDD
converged: YES YES NO NO
title: Mulliken charges:
elementType: N N C C C H H H H H H
charge: -0.065811 -0.081068 0.211866 -0.720890 -0.721063 0.227697 0.227675 0.233153 0.227633 0.227654 0.233155
chargesum: 0.00000
title: Mulliken charges with hydrogens summed into heavy atoms:
elementType: N N C C C
charge: -0.065811 -0.081068 0.211866 -0.032366 -0.032622
polarizability: 7.55289941e+01 1.20038869e-02 3.87247393e+01 -1.71417508e-02 -5.14889603e-05 2.99616163e+01
1716.lowfreq: -10.3276 -7.1351 -0.0011 -0.0005 0.0006 9.7991 105.5326 106.0398 202.0548
frequency: 105.5310 106.0031 202.0546 241.6874 318.1677 473.4004 605.2471 735.6840 973.5477 977.7704 1005.4031 1058.3104 1253.8099 1361.4678 1389.6972 1404.7337 1451.7873 1462.2921 1471.3613 1494.4815 2005.5970 2953.1382 2956.2729 3021.6317 3023.4326 3090.2069 3092.3578
redmass: 1.0279 1.1158 4.7836 2.7794 2.3693 12.2466 5.7332 4.5885 1.3509 1.2052 1.5819 1.3993 6.3607 3.9917 1.1796 1.1890 1.0470 1.0443 1.0463 1.1344 13.1318 1.0373 1.0373 1.0990 1.0991 1.0972 1.0971
irintensity: 0.0000 0.1258 1.5472 6.5372 1.5538 3.1486 5.1522 0.6434 2.9670 0.0008 16.6280 2.0502 5.2506 7.3281 11.7831 6.9780 0.0001 32.6350 16.4310 3.3881 283.0909 36.6424 67.6812 63.8235 0.0000 13.4014 24.3861
temp: 298.150 k
press: 1.00000 atm
elementType: 7 7 6 6 6 1 1 1 1 1 1
symmnumber: 1
zpe: 228696.5 jmol-1
zpe.correction: 0.087106 hartree
zpe.thermalcorrener: 0.093547 hartree
zpe.thermalcorrenthalpy: 0.094491 hartree
zpe.thermalcorrgfe: 0.057342 hartree
zpe.sumelectzpe: -226.967383 hartree
zpe.sumelectthermal: -226.960942 hartree
zpe.sumelectthermalent: -226.959998 hartree
zpe.sumelectthermalfe: -226.997147 hartree
dipole: 2.9217 0.0022 0.0007
dipole: 2.9217
quadrupole: -36.2906 -27.6585 -31.2090
quadrupole: -0.0022 0.0040 0.0000
quadrupole: -4.5713 4.0609 0.5104 -0.0022 0.0040 0.0000
hfenergy: -227.0544892 hartree
pointgroup: C01 [X(C3H6N2)]
dipole: -1.1494741 0.0003939 -0.000504 debye
dipolederiv: 1.5853375 -0.000279 0.0009112 -0.0011885 -0.2725691 0.0000035 0.0041322 0.0000017 0.0454517 -1.1339963 -0.0003469 0.0000914 0.0016148 -0.1259101 0. -0.0031928 0. -0.1373857 -0.4898486 0.0004932 -0.0010536 -0.0004808 0.2613334 -0.0000073 -0.0010859 0.0000025 -0.2488168 0.1083725 0.0958868 0.0002096 0.187771 0.006059 0.0003031 0.0002027 0.0003075 0.1780009 0.108499 -0.0958633 0.0002073 -0.1874457 0.0060065 -0.0002922 0.0002067 -0.0002998 0.1781418 -0.0455773 -0.072522 -0.1154234 -0.0701562 0.0633044 0.0196519 -0.1505681 -0.0330124 -0.0660556 -0.0458926 -0.0721855 0.1155092 -0.0697571 0.0635036 -0.0201261 0.1506032 0.0324339 -0.065501 0.002312 0.1324004 -0.0002711 0.0519701 -0.0641897 0.0001765 -0.0001674 0.0002347 0.123923 -0.0459486 0.0722317 0.1155032 0.0696716 0.0634614 0.0201725 0.1506942 -0.0325047 -0.0655698 -0.0456514 0.0725546 -0.1154273 0.0700498 0.063273 -0.0197181 -0.1506646 0.033058 -0.0660995 0.0023938 -0.1323701 -0.0002565 -0.052049 -0.0642724 -0.0001639 -0.0001601 -0.0002216 0.1239111 unknown
polarizability: 75.5289327|-0.028826|38.7247579|0.0473477|-0.0000646|29.9616591 unknown
InChI: InChI=1S/C3H6N2/c1-3(2)5-4/h1-2H3
charge 0 multiplicity 1
11 atoms
N  0.865839 0.000468 -0.000768
N  2.062134 -0.00174 0.002217
C  -0.450398 0.000283 -0.000939
C  -1.194846 -1.321351 -0.000579
C  -1.195109 1.321764 -0.000602
H  -1.845697 -1.409339 -0.893452
H  -1.847425 -1.407744 0.891171
H  -0.502778 -2.1806 0.00086
H  -1.847659 1.408042 0.891182
H  -1.846024 1.409546 -0.893447
H  -0.503237 2.181172 0.000758
