program: Gaussian 09
title: 000137665
version: EM64L-G09RevD.01
frameworkgroup: C1[X(C4H6Br2O)]
method: RPBEPBE
basis: SDD
operation: Freq
keyword: #p
keyword: freq=noraman
keyword: PBEPBE/SDD
title: #p freq=noraman PBEPBE/SDD
converged: YES YES NO NO
title: Mulliken charges:
elementType: Br Br O C C C C H H H H H H
charge: 0.056845 0.106673 -0.146207 -0.566996 0.350987 -0.613681 -0.750740 0.256012 0.277519 0.252960 0.257417 0.250639 0.268572
chargesum: 0.00000
title: Mulliken charges with hydrogens summed into heavy atoms:
elementType: Br Br O C C C C
charge: 0.056845 0.106673 -0.146207 -0.566996 0.350987 0.172810 0.025888
polarizability: 9.56406781e+01 3.63380906e+00 7.70755332e+01 -3.64388146e+00 3.01780408e+00 6.22338494e+01
1716.lowfreq: -10.5921 -2.7465 -0.0002 0.0002 0.0003 9.4831 53.2155 115.1434 149.0133
frequency: 53.1782 115.1273 149.0117 150.9313 201.1587 257.9067 281.8197 306.7770 314.8472 405.6353 527.4592 559.8064 631.4691 752.7970 950.0239 1005.8024 1054.8183 1075.3006 1087.4320 1189.3153 1371.0698 1395.8144 1437.0639 1450.7340 1460.1142 1468.5873 1639.4993 2992.1926 2995.2401 3086.8437 3092.6153 3119.1772 3131.4571
redmass: 5.4619 1.2375 4.3558 6.5904 7.3434 3.1954 1.7166 2.7545 1.8088 5.2912 3.8088 3.3869 3.5373 3.4821 1.9705 1.7137 1.8288 1.9642 2.5735 3.3074 1.2081 1.1779 1.0515 1.0530 1.0509 1.0491 10.1636 1.0387 1.0367 1.0934 1.0986 1.0996 1.1016
irintensity: 4.2592 0.5818 0.7684 0.9366 0.2805 3.2187 1.1482 4.5782 2.0420 25.0065 31.3705 19.5236 58.4900 6.4731 18.9324 12.3101 36.9218 70.1653 28.8848 40.1599 41.0248 26.0930 31.3849 3.7494 10.9444 16.3089 100.2720 0.3118 7.4831 6.1541 8.2430 6.4254 5.9794
temp: 298.150 k
press: 1.00000 atm
elementType: 35 35 8 6 6 6 6 1 1 1 1 1 1
symmnumber: 1
zpe: 237524.7 jmol-1
zpe.correction: 0.090468 hartree
zpe.thermalcorrener: 0.099566 hartree
zpe.thermalcorrenthalpy: 0.100510 hartree
zpe.thermalcorrgfe: 0.054374 hartree
zpe.sumelectzpe: -257.600053 hartree
zpe.sumelectthermal: -257.590956 hartree
zpe.sumelectthermalent: -257.590012 hartree
zpe.sumelectthermalfe: -257.636147 hartree
dipole: -2.2000 0.9060 3.5129
dipole: 4.2428
quadrupole: -58.8221 -61.2630 -60.0573
quadrupole: -4.7924 0.5399 5.0996
quadrupole: 1.2254 -1.2156 -0.0098 -4.7924 0.5399 5.0996
hfenergy: -257.6905219 hartree
pointgroup: C01 [X(C4H6Br2O1)]
dipole: 0.255002 -1.4494181 -0.7877531 debye
dipolederiv: -0.1934595 -0.0580387 0.0697675 -0.0484041 -0.28528 0.2898776 0.042095 0.282348 -0.6271414 -0.2639131 0.3125139 -0.0764312 0.3072158 -0.4969082 0.0990592 -0.0662159 0.0870428 -0.1095664 -0.5952888 -0.1643864 0.0722816 -0.2094163 -0.7104233 0.0231957 -0.02567 -0.0423143 -0.2084613 0.0821781 -0.3938046 0.1467636 -0.4801782 0.8762881 -0.3992239 0.0982583 -0.3715001 0.9004522 1.1113155 0.0657826 -0.2813763 0.3073917 0.7134638 0.063846 -0.0771093 0.0843704 -0.0453776 -0.1149874 0.0325366 0.003295 -0.0110894 -0.1640019 -0.0162288 -0.0469647 -0.0288988 -0.1851391 -0.3016595 0.2336943 0.0668862 0.1408317 -0.2154337 -0.0665893 0.0702982 -0.1011043 0.0279795 0.1133559 -0.0193415 0.0333696 -0.0128316 0.063088 0.0244908 0.0316355 0.0458601 -0.0736061 -0.0531733 -0.0484066 -0.0035209 -0.0328049 0.1079114 -0.0136267 0.0138887 -0.0003111 0.1178094 0.0606707 0.1009017 -0.0167242 0.1140816 -0.0530127 -0.0085156 0.001541 -0.0080444 0.0774011 0.1001771 -0.0709767 0.0612519 -0.0450143 0.0100472 0.054361 0.02326 0.0992018 0.0692805 0.1166027 0.0210016 -0.0377397 0.0139449 0.0902778 -0.0234735 -0.0037931 -0.0391108 -0.0618381 -0.0618186 -0.0114761 -0.0378231 -0.0437269 0.0639834 -0.0271723 -0.0612235 -0.0075394 0.1182075 unknown
polarizability: 74.145966|-9.6132124|85.7651203|-2.8789983|-13.1619816|75.0389745 unknown
InChI: InChI=1S/C4H6Br2O/c1-3(7)4(2,5)6/h1-2H3
charge 0 multiplicity 1
13 atoms
Br -0.927142 -0.943209 1.740546
Br -1.708951 1.513427 -0.331537
O  1.334895 1.432385 -0.03101
C  -0.569572 -0.130347 -0.12518
C  0.948085 0.246587 -0.105737
C  -0.968894 -1.160537 -1.185495
C  1.926039 -0.918976 -0.223992
H  -0.78051 -0.746312 -2.193334
H  -2.040617 -1.400021 -1.10389
H  -0.393006 -2.093705 -1.064259
H  1.614806 -1.793557 0.370003
H  1.998897 -1.231942 -1.283441
H  2.91997 -0.577592 0.103126
