program: Gaussian 09
title: 000137652
version: EM64L-G09RevD.01
frameworkgroup: C1[X(C5H4Cl2N2)]
method: RPBEPBE
basis: SDD
operation: Freq
keyword: #p
keyword: freq=noraman
keyword: PBEPBE/SDD
title: #p freq=noraman PBEPBE/SDD
converged: NO YES NO YES
title: Mulliken charges:
elementType: Cl Cl N N C C C C C H H H H
charge: -0.024592 -0.024611 0.127768 -0.669193 0.501369 -0.279186 -0.279197 -0.252809 -0.252798 0.254002 0.254018 0.322617 0.322613
chargesum: 0.00000
title: Mulliken charges with hydrogens summed into heavy atoms:
elementType: Cl Cl N N C C C C C
charge: -0.024592 -0.024611 0.127768 -0.023963 0.501369 -0.025184 -0.025179 -0.252809 -0.252798
polarizability: 1.18093770e+02 6.96181923e-04 1.08959598e+02 9.46881732e-03 -5.67304432e-03 3.30349033e+01
1716.lowfreq: -9.2196 0.0009 0.0012 0.0024 6.8440 11.4131 144.1060 167.6314 188.5595
frequency: 144.1055 167.6303 188.5595 220.4832 248.2480 359.8210 413.6394 415.5639 452.1435 463.6646 519.6224 565.1928 598.4722 707.8826 767.2476 842.3139 844.6059 902.5445 950.1061 1038.2041 1075.8707 1159.4189 1315.1016 1342.2436 1410.3174 1443.4528 1543.6322 1596.9609 1648.8370 3171.7221 3174.2735 3559.8258 3698.4912
redmass: 9.8763 4.0983 19.6854 4.9305 4.9806 19.6961 7.8619 1.0320 1.2344 4.1109 7.3748 5.8512 5.2802 3.1725 9.7916 1.3467 1.7817 6.6627 6.2334 1.4288 1.9411 1.6382 2.4770 3.5441 4.8934 6.1634 7.9595 5.1895 1.2291 1.0932 1.0943 1.0456 1.1042
irintensity: 3.7338 0.0000 0.1218 0.0992 3.2041 2.9544 10.4831 0.0001 321.3064 7.9303 2.2912 0.0000 0.7895 7.0955 150.8311 0.0020 73.0504 60.6442 1.4371 18.5863 55.2797 53.6751 0.1419 162.0329 49.3733 8.5818 275.2156 345.8205 240.7653 0.9113 3.4590 91.0597 28.7441
temp: 298.150 k
press: 1.00000 atm
elementType: 17 17 7 7 6 6 6 6 6 1 1 1 1
symmnumber: 1
zpe: 221011.3 jmol-1
zpe.correction: 0.084179 hartree
zpe.thermalcorrener: 0.092434 hartree
zpe.thermalcorrenthalpy: 0.093378 hartree
zpe.thermalcorrgfe: 0.050402 hartree
zpe.sumelectzpe: -1221.908857 hartree
zpe.sumelectthermal: -1221.900602 hartree
zpe.sumelectthermalent: -1221.899658 hartree
zpe.sumelectthermalfe: -1221.942634 hartree
dipole: -0.0003 -7.0982 0.0006
dipole: 7.0982
quadrupole: -65.9062 -52.7437 -68.5300
quadrupole: 0.0010 0.0000 -0.0013
quadrupole: -3.5129 9.6496 -6.1367 0.0010 0.0000 -0.0013
hfenergy: -1221.9930358 hartree
pointgroup: C01 [X(C5H4Cl2N2)]
dipole: 2.7926243 0.0107338 -0.0002184 debye
dipolederiv: -0.3112438 -0.3606032 -0.0000183 -0.3278013 -0.7634648 -0.0000435 0.0000127 0.0000094 -0.0838492 -0.3165507 0.3639986 0.0000725 0.3312434 -0.7581841 -0.0001231 0.0000681 -0.0001382 -0.0838663 -0.5641525 0.0039226 0.0000177 0.0039156 -1.5867077 -0.0001645 0.0000626 -0.0002057 -0.117849 -1.5167368 -0.0052415 0.0000315 -0.0052585 -0.1656635 0.0000315 -0.0000237 0.0000368 -0.7203202 1.6923136 0.0049437 -0.0000606 0.0049468 0.4198866 0.0000436 -0.0000626 0.0000245 0.1783062 -0.6653271 -0.1975777 0.000012 -0.4360131 -0.3611746 -0.0000018 -0.0000177 0.0000037 -0.1782579 -0.6702532 0.1951771 0.0000659 0.4336056 -0.3563066 -0.0000545 0.0000998 -0.0000319 -0.1782551 0.9023107 0.2733875 -0.0000273 0.4053674 1.6583643 0.0001292 -0.0000515 0.0001249 0.0106133 0.9075541 -0.27913 -0.0001262 -0.4111051 1.6531673 0.0002665 -0.0001532 0.0002628 0.010613 0.0338726 0.0815919 0.0000161 0.0609208 -0.0019843 -0.0000263 0.0000124 -0.0000249 0.18965 0.0350003 -0.0812767 -0.0000001 -0.0606373 -0.0030884 -0.0000196 0.000001 -0.0000233 0.189649 0.2363702 0.0109326 0.000008 0.0510532 0.1328192 -0.0000168 0.0000362 -0.0000142 0.3917838 0.2368424 -0.0101248 0.0000088 -0.0502376 0.1323364 -0.0000207 0.0000159 -0.0000238 0.3917824 unknown
polarizability: 108.9597244|-0.0340185|118.0936437|-0.005709|0.0094472|33.0349033 unknown
InChI: InChI=1S/C5H4Cl2N2/c6-4-1-3(8)2-5(7)9-4/h1-2H,8H2
charge 0 multiplicity 1
13 atoms
Cl -1.590214 -2.70556 -0.000187
Cl -1.610928 2.693185 0.000488
N  -1.363079 -0.005324 0.000067
N  2.867518 0.011073 -0.000176
C  1.485306 0.005703 -0.000133
C  0.753144 -1.223006 -0.000208
C  0.743645 1.228684 0.000027
C  -0.647067 -1.143303 -0.000174
C  -0.655879 1.138143 0.000155
H  1.258783 -2.191786 -0.000323
H  1.24167 2.201388 0.00012
H  3.386669 0.884959 -0.000172
H  3.393432 -0.858756 -0.000285
