program: Gaussian 09
title: 000137647
version: EM64L-G09RevD.01
frameworkgroup: C1[X(C15H10S)]
method: RPBEPBE
basis: SDD
operation: Freq
keyword: #pfreq=noraman
keyword: PBEPBE/SDD
title: #p freq=noraman PBEPBE/SDD
converged: NO YES NO NO
title: Mulliken charges:
elementType: S C C C C C C C C C C C C C C C H H H H H H H H H H
charge: 0.002294 0.132672 0.133583 -0.590316 0.415435 0.415531 -0.387531 -0.387663 -0.383205 -0.383229 -0.229382 -0.229356 -0.226449 -0.226454 -0.231529 -0.231533 0.224746 0.224814 0.273854 0.273720 0.232867 0.232864 0.236305 0.236289 0.235841 0.235834
chargesum: 0.00000
title: Mulliken charges with hydrogens summed into heavy atoms:
elementType: S C C C C C C C C C C C C C C C
charge: 0.002294 0.132672 0.133583 -0.590316 0.415435 0.415531 -0.162785 -0.162849 -0.109351 -0.109509 0.003485 0.003508 0.009856 0.009835 0.004312 0.004300
polarizability: 3.21138196e+02 -6.63555401e-03 2.28409000e+02 7.21910303e-03 1.00351421e-02 6.66768698e+01
1716.lowfreq: -7.4961 -0.0021 0.0001 0.0004 3.9444 9.6210 40.8519 41.0996 55.5677
frequency: 40.8487 41.0783 55.5677 75.0010 80.6162 136.9444 213.0867 243.3591 257.2509 336.6359 400.4906 403.8071 416.0272 446.5330 476.9269 583.6775 608.3573 609.3278 622.4963 654.5952 662.9261 695.3538 696.6779 751.0516 764.8635 781.2299 792.3470 854.1811 858.0550 937.9569 940.1751 986.6159 987.3519 988.3053 988.9608 1007.6323 1007.8078 1010.5099 1021.0796 1038.4190 1082.4094 1086.1164 1128.2482 1175.8277 1176.6100 1186.6204 1190.3987 1314.8533 1318.5386 1349.4592 1361.9163 1381.6606 1385.0608 1438.1563 1442.1849 1471.2606 1492.2338 1576.2357 1577.9548 1603.1004 1609.0395 1801.0085 3130.6091 3131.4814 3138.3660 3140.0335 3148.8241 3150.0313 3158.8367 3159.7708 3171.1630 3171.6836
redmass: 3.7107 4.1533 5.4370 6.7002 10.3494 4.7475 5.3533 5.9040 5.8442 7.7996 2.9879 2.8074 3.5586 4.2085 8.7396 5.6347 6.5019 6.5931 4.3630 7.9863 8.8659 1.6278 1.7071 6.8976 8.3549 1.8392 2.0336 1.2580 1.2496 1.4589 1.4263 6.2095 1.3890 6.1745 1.3887 1.3415 1.3399 4.7657 2.4590 2.2900 1.6944 1.6065 3.1278 1.0608 1.0579 1.1154 1.1292 1.5450 1.3668 3.6420 3.8465 7.2187 10.1692 2.3276 2.4351 2.1008 2.7320 5.7624 5.7359 5.8327 5.9444 11.9280 1.0853 1.0851 1.0882 1.0878 1.0927 1.0925 1.0973 1.0971 1.1017 1.1016
irintensity: 0.0709 0.6426 0.3535 0.0355 1.2233 0.0000 0.0822 0.0114 0.2192 0.0005 0.0000 0.0002 0.0000 1.3926 4.6679 26.7693 0.1363 0.5883 0.0000 8.6104 12.6965 0.0106 108.1559 6.5055 4.6107 107.0297 0.0002 0.0001 0.4984 0.0145 8.5702 0.0022 0.0006 0.0121 0.5759 0.0077 0.2133 22.1293 2.8267 0.2528 3.4141 6.8000 3.3761 1.0810 0.0895 10.1531 1.9334 71.8160 1.2793 111.9225 252.3699 10.0373 68.2266 2.0553 0.1933 0.0012 0.6659 0.9305 3.5281 0.2837 6.2673 32.8800 4.3581 0.1357 1.3014 3.2107 26.9774 0.6290 2.0940 39.3345 46.3552 9.3624
temp: 298.150 k
press: 1.00000 atm
elementType: 16 6 6 6 6 6 6 6 6 6 6 6 6 6 6 6 1 1 1 1 1 1 1 1 1 1
symmnumber: 1
zpe: 515134.8 jmol-1
zpe.correction: 0.196205 hartree
zpe.thermalcorrener: 0.209349 hartree
zpe.thermalcorrenthalpy: 0.210293 hartree
zpe.thermalcorrgfe: 0.154082 hartree
zpe.sumelectzpe: -974.522716 hartree
zpe.sumelectthermal: -974.509572 hartree
zpe.sumelectthermalent: -974.508628 hartree
zpe.sumelectthermalfe: -974.564839 hartree
dipole: 0.0057 -5.8916 0.0005
dipole: 5.8916
quadrupole: -71.5367 -103.4599 -106.3649
quadrupole: 0.0224 0.0018 0.0051
quadrupole: 22.2505 -9.6727 -12.5778 0.0224 0.0018 0.0051
hfenergy: -974.7189209 hartree
pointgroup: C01 [X(C15H10S1)]
dipole: -0.0044348 2.3179458 -0.000814 debye
dipolederiv: -0.1602716 0.0020507 -0.000007 0.00206 -1.0740066 0.0003249 -0.0000086 0.0003913 -0.1817245 0.5792843 0.3861458 -0.000205 0.5095023 -0.4759838 0.0000782 -0.0003167 0.0002508 0.0756397 0.5823724 -0.3813945 -0.0000816 -0.5054038 -0.4775626 0.000422 -0.0001824 0.0003878 0.0757204 -0.5164464 -0.0059739 0.0000783 -0.0064004 1.9543664 -0.0008633 0.0000371 -0.0008854 -0.239174 -0.1242226 0.035184 0.0000236 -0.1450622 -0.039505 0.0000746 0.0002194 -0.0001069 0.0478168 -0.1233622 -0.0353125 0.0000917 0.1449813 -0.0399499 -0.0000198 0.0000978 -0.0000259 0.0477848 0.0366042 -0.1157726 -0.0000198 0.1017693 -0.0424611 -0.0000412 -0.0000889 0.0000159 -0.136466 0.0357528 0.115816 -0.0002236 -0.1012376 -0.0426769 -0.000064 -0.0001309 -0.0001187 -0.1364868 -0.0132222 0.0833502 -0.0000442 -0.1028417 0.0381421 -0.0000103 0.0000082 -0.0000766 -0.1201074 -0.0135319 -0.0832923 0.0000085 0.102902 0.0385392 -0.0001939 0.0000386 -0.0001266 -0.120177 -0.2877772 0.0290335 0.0000323 0.1125049 0.1626384 -0.0001166 -0.0000033 -0.0000747 -0.1473876 -0.2869429 -0.0299613 0.0000783 -0.113164 0.1623199 -0.0002657 0.0002035 -0.00028 -0.1473496 0.1227792 -0.1544644 -0.0000294 -0.2118934 -0.0934936 0.0000408 -0.0000439 0.0000344 -0.1458016 0.1221688 0.1546215 -0.000302 0.2121116 -0.0925878 -0.0001617 -0.0004484 -0.0001218 -0.1457419 0.0361837 0.0183836 -0.000043 -0.0448648 0.0237914 -0.0000302 -0.0000174 -0.0000507 -0.1395753 0.0358771 -0.0185562 -0.0000787 0.044688 0.0237179 -0.0001709 -0.0001091 -0.0001694 -0.1396629 -0.0296245 0.1066632 0.000013 0.0867743 0.0458669 -0.0000033 0.0000385 0.0000063 0.1430069 -0.0291333 -0.1066848 0.0002213 -0.086839 0.0455803 0.000145 0.0002211 0.0001326 0.1430253 0.1222769 -0.0300956 0.0000162 -0.0029647 -0.022535 0.0000494 0.0000185 0.0000528 0.1554777 0.1220226 0.0304617 0.0000013 0.0034212 -0.0227352 0.000166 0.000025 0.0001182 0.1555175 0.0684325 -0.01074 0.0000257 -0.0586938 -0.1202952 0.0000919 0.0000366 0.0000817 0.1592359 0.0682585 0.0110739 0.0000399 0.0590397 -0.1201341 0.0002504 0.0000003 0.0002708 0.1592332 -0.0855954 0.066558 0.0000491 0.1020585 0.0329081 0.0000074 0.0000355 0.0000202 0.159216 -0.0854191 -0.0668554 0.0002087 -0.1022274 0.0326377 0.0001815 0.0002257 0.0001677 0.1592049 -0.0880634 -0.0864509 0.0000887 -0.0912829 0.0515693 0.0000524 0.0000882 0.0000477 0.1593852 -0.0884004 0.0862123 0.0000577 0.0910625 0.051849 0.0000561 0.0000558 0.0000585 0.1593905 unknown
polarizability: 321.1380981|0.0804279|228.4090314|-0.0851572|-0.0794992|66.6769366 unknown
InChI: InChI=1S/C15H10S/c16-15-13(11-7-3-1-4-8-11)14(15)12-9-5-2-6-10-12/h1-10H
charge 0 multiplicity 1
26 atoms
S  0.004974 -3.691875 0.002329
C  0.696177 -0.73773 0.000893
C  -0.701045 -0.741194 0.001247
C  0.000738 -2.012407 0.001589
C  1.966184 -0.053879 0.00035
C  -1.97274 -0.05975 0.001542
C  2.063556 1.368446 -0.000068
C  -2.072058 1.362316 0.000277
C  3.157567 -0.838486 0.000262
C  -3.162574 -0.846474 0.003049
C  3.326504 1.990261 -0.000553
C  -3.336112 1.98208 0.000421
C  4.417877 -0.209405 -0.000242
C  -4.423978 -0.219375 0.003244
C  4.5055 1.20381 -0.000651
C  -4.513793 1.193685 0.001921
H  1.149944 1.973203 0.000023
H  -1.159472 1.968529 -0.000906
H  3.069707 -1.930417 0.000592
H  -3.07307 -1.938218 0.003964
H  3.400315 3.083099 -0.000862
H  -3.411833 3.074793 -0.000644
H  5.330998 -0.813946 -0.000312
H  -5.336199 -0.825288 0.004363
H  5.486614 1.691411 -0.00103
H  -5.495684 1.679712 0.002002
