program: Gaussian 09
title: 000137622
version: EM64L-G09RevD.01
frameworkgroup: C1[X(C6H14ClO3P)]
method: RPBEPBE
basis: SDD
operation: Freq
keyword: #p
keyword: freq=noraman
keyword: PBEPBE/SDD
title: #p freq=noraman PBEPBE/SDD
converged: YES YES NO NO
title: Mulliken charges:
elementType: Cl P O O O C C C C C C H H H H H H H H H H H H H H
charge: -0.220349 1.175268 -0.496377 -0.514921 -0.547608 -0.364755 -0.364051 -0.229833 -0.227320 -0.676611 -0.674255 0.226791 0.223470 0.219558 0.223848 0.229916 0.234584 0.228743 0.232114 0.215137 0.232306 0.212487 0.214823 0.230988 0.216049
chargesum: 0.00000
title: Mulliken charges with hydrogens summed into heavy atoms:
elementType: Cl P O O O C C C C C C
charge: -0.220349 1.175268 -0.496377 -0.514921 -0.547608 0.085506 0.079355 0.234667 0.233536 -0.016682 -0.012395
polarizability: 1.33223507e+02 2.84433535e+00 1.07409346e+02 2.26339629e+00 -1.79852870e+00 1.04624601e+02
1716.lowfreq: -1.2961 -0.0015 -0.0005 0.0030 7.6726 11.4785 27.4803 28.3963 43.9724
frequency: 26.5845 27.8755 43.8945 46.6576 66.4479 103.7811 110.9570 128.1869 189.1398 195.2343 215.1915 223.1590 229.5338 239.3640 272.6609 309.4124 342.6755 414.6843 432.7124 441.6856 677.7468 740.8777 764.4872 766.2812 884.3541 887.1103 891.7067 893.7571 933.6991 947.0609 1044.8402 1047.2527 1071.3664 1129.9247 1130.1143 1138.8126 1142.3183 1225.9420 1230.7927 1281.6920 1284.7096 1304.6213 1307.1124 1365.5858 1371.9864 1394.7260 1397.1046 1472.6824 1473.3858 1479.2886 1479.6095 1480.1438 1480.4765 1489.3958 1490.2388 2981.8016 2983.6791 2989.0161 2999.0372 3009.0771 3012.9936 3047.4722 3053.6918 3066.8467 3070.8941 3087.0613 3087.8301 3089.9813 3093.6845
redmass: 2.3250 3.3160 2.5219 1.7767 5.1220 4.3281 2.9273 3.4354 5.6132 5.3098 1.2194 1.1381 4.1053 4.3166 13.0836 4.8359 4.3478 5.7703 8.5116 8.8466 10.0291 9.7968 1.0733 1.0740 1.1518 1.1455 2.0774 2.1391 4.3805 5.3054 2.9783 2.9333 14.5459 2.2257 2.2422 1.4103 1.4377 1.2696 1.2531 1.1026 1.1011 1.3055 1.3272 1.3802 1.3534 1.2029 1.2045 1.0662 1.0646 1.0537 1.0581 1.0536 1.0572 1.0853 1.0842 1.0359 1.0360 1.0560 1.0568 1.0595 1.0592 1.1038 1.1020 1.1050 1.1049 1.0989 1.0991 1.1046 1.1063
irintensity: 0.5846 0.3111 0.5553 0.7919 1.0338 1.9743 0.4995 3.5309 4.9336 4.7858 1.2231 0.4308 10.7828 5.9195 4.1302 1.7777 7.0696 32.1209 30.5938 102.7544 72.6228 132.4820 5.7680 6.9614 2.8399 2.1759 13.1885 82.0948 310.4112 102.8170 8.8767 4.8999 122.6765 7.2748 7.4474 0.4883 0.4395 0.4384 0.4803 0.1388 0.3055 1.4255 1.1000 2.9785 5.6150 11.5402 14.2534 2.3222 7.1340 8.3354 6.7879 7.1303 7.6855 22.5519 21.4801 30.1975 26.2814 27.2204 13.0926 26.1983 26.1603 2.1040 2.5372 0.0259 2.9409 35.5751 34.0976 73.0348 69.7240
temp: 298.150 k
press: 1.00000 atm
elementType: 17 15 8 8 8 6 6 6 6 6 6 1 1 1 1 1 1 1 1 1 1 1 1 1 1
symmnumber: 1
zpe: 524766.5 jmol-1
zpe.correction: 0.199873 hartree
zpe.thermalcorrener: 0.215433 hartree
zpe.thermalcorrenthalpy: 0.216377 hartree
zpe.thermalcorrgfe: 0.153932 hartree
zpe.sumelectzpe: -1263.071053 hartree
zpe.sumelectthermal: -1263.055493 hartree
zpe.sumelectthermalent: -1263.054549 hartree
zpe.sumelectthermalfe: -1263.116994 hartree
dipole: -0.4725 4.5987 1.7611
dipole: 4.9470
quadrupole: -65.9569 -88.8314 -88.6818
quadrupole: 0.1056 0.5686 -2.8472
quadrupole: 15.1998 -7.6747 -7.5251 0.1056 0.5686 -2.8472
hfenergy: -1263.2709256 hartree
pointgroup: C01 [X(C6H14Cl1O3P1)]
dipole: -0.2569601 1.6275058 1.0359985 debye
dipolederiv: -0.3761054 -0.015667 -0.0207718 0.0366799 -0.5577535 0.2100177 -0.0158631 0.3771162 -0.6803105 2.1565029 0.1489752 0.1709465 -0.3466006 1.8812746 -0.1238612 -0.1595208 -0.2575052 1.7252176 -1.1265869 -0.3537587 -0.2267683 -0.4514735 -0.8234611 -0.1634557 -0.3456344 -0.2345108 -0.6297763 -1.4962483 0.2976464 0.0576222 0.4409229 -0.6834574 -0.0352908 0.2314901 -0.081193 -0.5061617 -0.6764807 -0.0290604 -0.0452468 0.0584064 -0.594563 -0.0281831 0.0099212 -0.0528213 -0.6608299 0.0451926 -0.047823 -0.0195629 -0.1190475 0.0585935 -0.0518074 -0.178474 -0.1292082 0.0477139 -0.1498366 0.0934608 0.0316067 -0.0663713 0.1036288 -0.0225891 0.0315002 -0.019012 0.1310401 0.4969992 0.1428486 0.1503342 0.3278227 0.5308882 0.1114884 0.5695573 0.3130965 0.3838287 1.0788671 -0.3182411 -0.0730161 0.0803057 0.1625795 -0.0083624 -0.0917667 0.0052038 0.312945 -0.0517923 -0.0876516 -0.0382361 -0.0425628 0.0651551 -0.0346727 0.086245 0.0241089 0.0525497 0.0208161 -0.0083108 0.0159161 0.1378193 -0.0086364 -0.0198576 0.0337865 -0.0173905 0.0914141 0.0068478 0.0712458 0.028283 0.0990647 -0.061215 -0.0717279 0.0406565 -0.0438822 0.0584621 0.0640429 0.0108474 -0.0490265 -0.0004392 0.0132513 0.0989866 -0.0052678 0.0980761 -0.0783752 0.0105568 -0.0494579 -0.0900807 -0.0197503 0.0392972 -0.0562173 -0.0931894 -0.076219 -0.0603296 0.055848 -0.0431258 0.0509421 -0.0188395 -0.013755 0.0841651 0.0538796 0.1135143 -0.0428868 0.0574492 -0.0189674 -0.0076671 -0.0299504 -0.0238037 0.0875748 -0.0733922 0.0147873 -0.0645702 -0.027028 0.0668653 0.0252633 0.0399542 -0.0584284 -0.0655636 -0.0380867 -0.0606567 0.026141 -0.0346708 0.0346954 0.0091933 -0.0557264 -0.0076415 0.0837499 0.050684 0.0937143 -0.0292088 -0.0675849 0.0138035 -0.0234757 -0.0410988 0.0378067 -0.0563904 -0.0679163 -0.075626 -0.0570156 0.1040806 0.0011317 -0.0127906 0.0272764 -0.0083191 0.1331498 -0.0556694 0.0803696 -0.0938254 -0.1502299 -0.1125551 0.033436 -0.1149858 0.0538549 -0.0003446 0.0304123 -0.0023777 0.0654596 0.0181288 0.1468166 0.0458672 0.0917311 -0.0697978 -0.0749491 0.004071 -0.0627963 0.0497265 0.0503012 -0.0147305 0.0176619 -0.07335 0.001043 0.135623 0.0607444 0.1180041 -0.0524343 -0.0205831 0.1030212 0.0288877 0.1167357 -0.1090116 -0.053532 0.0412244 -0.0539418 0.0958165 0.0115138 -0.0320083 -0.0593178 -0.076523 0.072471 -0.0779505 -0.1193918 -0.0708506 -0.0845904 unknown
polarizability: 132.8311129|2.7227398|108.0811943|4.1447994|-0.9298609|104.3451479 unknown
InChI: InChI=1S/C6H14O3P.Cl/c1-3-5-8-10(7)9-6-4-2;/h3-6H2,1-2H3;
charge 0 multiplicity 1
25 atoms
Cl 0.070207 -2.134899 0.936031
P  0.054958 -0.863292 -0.98625
O  1.589977 -0.131379 -1.028439
O  -0.928733 0.460067 -0.497211
O  -0.347786 -1.670792 -2.280484
C  3.502563 1.126946 -0.258901
C  -2.986004 1.629778 0.008816
C  2.121567 0.620799 0.156661
C  -2.400594 0.254726 -0.313529
C  4.172966 1.906378 0.895798
C  -4.513977 1.542541 0.228377
H  4.127282 0.264515 -0.554317
H  3.396637 1.773693 -1.148738
H  -2.49225 2.02836 0.914187
H  -2.756906 2.321932 -0.821869
H  2.177648 -0.073738 1.016052
H  1.426038 1.447414 0.390061
H  -2.556159 -0.46029 0.517277
H  -2.824663 -0.162654 -1.24637
H  4.315494 1.266045 1.786014
H  5.165965 2.275123 0.584716
H  3.568914 2.781862 1.198686
H  -4.763497 0.86748 1.06786
H  -4.927067 2.53896 0.463637
H  -5.031181 1.168627 -0.674564
