program: Gaussian 09
title: 000137617
version: EM64L-G09RevD.01
frameworkgroup: C1[X(C2H4OS)]
method: RPBEPBE
basis: SDD
operation: Freq
keyword: #pfreq=noraman
keyword: PBEPBE/SDD
title: #p freq=noraman PBEPBE/SDD
converged: YES YES NO NO
title: Mulliken charges:
elementType: S O C C H H H H
charge: 0.335863 -0.610516 -0.389376 -0.444884 0.279175 0.229967 0.232864 0.366908
chargesum: 0.00000
title: Mulliken charges with hydrogens summed into heavy atoms:
elementType: S O C C
charge: 0.335863 -0.243608 -0.110201 0.017946
polarizability: 6.93316812e+01 -1.68247749e+00 3.48506577e+01 1.96800605e+00 -2.12046308e+00 2.28480795e+01
1716.lowfreq: -19.8683 -11.0658 0.0021 0.0028 0.0031 1.8493 90.5100 196.5493 345.6761
frequency: 90.4096 196.5462 345.6759 375.9164 587.7608 624.1701 665.5308 918.3257 960.9736 1022.0577 1142.4593 1245.7958 1391.2419 1590.6553 3098.9209 3148.4686 3208.8213 3487.7508
redmass: 2.2752 4.2215 1.0935 3.9791 1.5879 10.8199 3.8138 1.3676 1.0952 1.3520 1.0758 1.2181 1.2161 3.9639 1.0585 1.0971 1.1150 1.0677
irintensity: 15.4212 2.2454 128.6320 6.4884 26.7575 15.5373 7.2987 67.1161 69.3738 8.2770 26.8376 5.6803 7.0429 33.7630 1.2182 2.9026 10.4893 21.6409
temp: 298.150 k
press: 1.00000 atm
elementType: 16 8 6 6 1 1 1 1
symmnumber: 1
zpe: 144158.9 jmol-1
zpe.correction: 0.054907 hartree
zpe.thermalcorrener: 0.060373 hartree
zpe.thermalcorrenthalpy: 0.061317 hartree
zpe.thermalcorrgfe: 0.026303 hartree
zpe.sumelectzpe: -551.504153 hartree
zpe.sumelectthermal: -551.498687 hartree
zpe.sumelectthermalent: -551.497743 hartree
zpe.sumelectthermalfe: -551.532757 hartree
dipole: 1.5644 0.4361 1.6508
dipole: 2.3158
quadrupole: -30.5855 -30.4498 -31.3499
quadrupole: 0.1206 -3.5887 0.1043
quadrupole: 0.2096 0.3452 -0.5548 0.1206 -3.5887 0.1043
hfenergy: -551.55906 hartree
pointgroup: C01 [X(C2H4O1S1)]
dipole: -0.6257523 0.0415653 0.6609171 debye
dipolederiv: 0.1449759 -0.0211465 0.1242985 -0.2293964 0.1063152 -0.1102928 0.300801 -0.1647233 0.1442243 -0.6044126 -0.1363559 -0.029835 0.0201656 -0.4198667 0.1367153 -0.3520066 0.1877256 -0.1922357 0.4412181 0.197427 -0.1829443 0.2167603 0.09609 0.0520499 -0.1082482 0.0811061 -0.2293954 -0.3537308 -0.0076894 0.0110722 -0.0251672 0.0372152 0.0682931 -0.0670891 0.0709877 -0.381421 0.0318253 -0.0109075 0.0326463 -0.0614862 -0.0492895 -0.0305999 0.1300625 -0.0238782 0.1934684 -0.0379484 -0.1000901 0.0139098 -0.0657476 0.0364015 -0.0244716 0.0126139 -0.0301664 0.2101983 0.1052413 0.0044549 0.0222843 0.02936 -0.0666234 -0.0521329 0.0203786 -0.0290343 0.1929255 0.2728312 0.0743076 0.0085681 0.1155115 0.2597577 -0.0395609 0.0634878 -0.0920173 0.0622356 unknown
polarizability: 69.3911768|-1.942847|34.8719814|-0.61324|-2.0056553|22.7672602 unknown
InChI: InChI=1S/C2H4OS/c1-2-4-3/h2-3H,1H2
charge 0 multiplicity 1
8 atoms
S  0.738584 0.669101 -0.378497
O  2.035331 -0.478212 0.200083
C  -0.694602 -0.433034 -0.174511
C  -1.947835 0.017432 0.084048
H  -0.455745 -1.486758 -0.35923
H  -2.792402 -0.680534 0.089246
H  -2.171281 1.073166 0.273534
H  2.103251 -0.358262 1.189127
