program: Gaussian 09
title: 000137610
version: EM64L-G09RevD.01
frameworkgroup: C1[X(C13H12O)]
method: RPBEPBE
basis: SDD
operation: Freq
keyword: #pfreq=noraman
keyword: PBEPBE/SDD
title: #p freq=noraman PBEPBE/SDD
converged: YES YES NO NO
title: Mulliken charges:
elementType: O C C C C C C C C C C C C C H H H H H H H H H H H H
charge: -0.223488 0.447404 0.447405 0.365948 0.365949 -0.599102 -0.599101 -0.076571 -0.414286 -0.414286 -0.781276 -0.781276 -0.254118 -0.254118 0.208910 0.208910 0.240190 0.240190 0.249675 0.249408 0.200712 0.200713 0.249408 0.249675 0.236563 0.236563
chargesum: 0.00000
title: Mulliken charges with hydrogens summed into heavy atoms:
elementType: O C C C C C C C C C C C C C
charge: -0.223488 0.447404 0.447405 0.365948 0.365949 -0.390191 -0.390191 -0.076571 -0.174096 -0.174096 -0.081481 -0.081481 -0.017555 -0.017555
polarizability: 2.53568920e+02 -1.01204524e-05 1.54907573e+02 8.38520038e-03 -1.75463468e-04 6.47677716e+01
1716.lowfreq: -10.1485 -5.4060 -3.0757 0.0006 0.0007 0.0007 47.2845 84.2335 125.1458
frequency: 47.2433 84.2326 125.1452 158.2788 158.3303 259.4589 260.5009 290.7896 297.8328 334.6340 360.3663 365.8877 393.9196 471.9351 472.0129 481.1303 573.8607 584.8757 638.0834 653.5374 717.8592 756.9132 775.5060 782.4688 804.8461 868.5702 884.4842 925.4511 941.4437 952.9690 971.8422 994.4846 1008.2580 1045.5228 1052.5225 1052.9299 1058.2245 1125.0912 1167.0534 1183.4909 1223.8627 1231.7601 1268.4476 1312.4846 1376.6449 1397.3680 1398.9294 1413.5792 1419.3786 1435.1438 1440.0792 1440.8539 1449.9288 1470.5874 1487.2012 1494.5874 1558.5473 1607.6069 1625.5564 1630.6201 2986.1638 2986.3812 3066.3582 3067.0292 3077.1065 3079.1658 3096.4424 3096.9499 3122.9649 3127.5468 3146.6380 3167.1721
redmass: 5.5414 3.4484 3.1858 1.1149 1.0419 3.4919 3.2495 3.9673 2.7391 6.0973 7.8569 3.2619 4.8074 5.1232 3.3322 2.7422 2.9180 4.4881 6.0149 5.5961 6.8449 1.4264 2.8104 2.8208 3.3550 1.3099 4.4170 1.3685 1.6654 4.5324 1.4435 1.3709 1.9030 1.7132 1.5347 1.6183 1.9764 1.9567 2.3667 1.2086 1.8733 2.5615 2.3373 2.1966 2.5472 1.2589 1.2154 1.8329 2.5346 1.7324 1.0472 1.0458 1.4951 1.2181 2.0579 3.7387 6.3528 5.7466 5.8884 6.8132 1.0360 1.0360 1.0954 1.0955 1.0886 1.0891 1.1006 1.1002 1.0866 1.0893 1.0934 1.1006
irintensity: 4.0838 0.0000 5.1651 0.9240 0.0029 0.1204 0.0344 0.0197 2.1508 4.6950 2.5473 0.4366 7.2105 6.0531 0.0000 7.6973 0.0002 1.9740 1.5463 1.2106 0.0070 77.8790 0.0000 6.1073 0.3256 0.0000 0.9677 19.4726 0.0001 5.9882 10.8166 0.0000 26.1016 2.5746 0.0000 19.4981 0.1308 5.8935 8.7040 2.2751 3.0436 36.2400 1.5590 8.4444 1.7828 53.8409 28.4942 1.7347 2.6965 3.7185 24.4791 0.0000 18.3159 4.1846 37.1473 185.4533 11.1464 3.0947 11.4063 20.8882 28.3354 7.1311 22.2134 0.0022 22.6383 0.9953 51.0882 1.7037 11.9681 0.1584 22.2314 30.9649
temp: 298.150 k
press: 1.00000 atm
elementType: 8 6 6 6 6 6 6 6 6 6 6 6 6 6 1 1 1 1 1 1 1 1 1 1 1 1
symmnumber: 1
zpe: 548996.7 jmol-1
zpe.correction: 0.209102 hartree
zpe.thermalcorrener: 0.221159 hartree
zpe.thermalcorrenthalpy: 0.222104 hartree
zpe.thermalcorrgfe: 0.171010 hartree
zpe.sumelectzpe: -576.818529 hartree
zpe.sumelectthermal: -576.806471 hartree
zpe.sumelectthermalent: -576.805527 hartree
zpe.sumelectthermalfe: -576.856621 hartree
dipole: 4.3276 0.0000 0.0175
dipole: 4.3276
quadrupole: -86.3820 -69.3521 -86.2250
quadrupole: 0.0000 -0.0901 0.0000
quadrupole: -5.7290 11.3010 -5.5720 0.0000 -0.0901 0.0000
hfenergy: -577.0276309 hartree
pointgroup: C01 [X(C13H12O1)]
dipole: 1.7002833 -0.0000671 0.0891464 debye
dipolederiv: -1.3368615 0.0000358 -0.0526469 0.0000351 -0.4554891 -0.0000049 -0.0527143 -0.0000048 -0.3294876 -0.0150273 0.0749097 -0.0043415 -0.1223217 -0.0802958 -0.0059644 -0.0032862 0.0040445 0.0598263 -0.0150233 -0.0749142 -0.0043493 0.1223166 -0.0802998 0.0059511 -0.0032758 -0.0040578 0.0598262 -0.1007781 0.3333532 -0.0061288 0.5947773 0.1063011 0.0295593 -0.0057754 0.0161868 -0.0089311 -0.100847 -0.3333374 -0.0061688 -0.5947625 0.1063759 -0.0295431 -0.0058469 -0.0161681 -0.0089363 0.1875048 -0.1947043 0.0168914 0.1086915 0.1566183 0.0044839 0.0151369 -0.0105988 -0.1353488 0.1875108 0.1947004 0.0169117 -0.1086955 0.1566114 -0.0044563 0.0151334 0.0106252 -0.1353477 1.3695454 -0.0000428 0.0679651 -0.0000421 0.3144969 0.0000076 0.0698182 0.0000084 0.0853783 -0.1114744 -0.0003987 0.002619 -0.0909334 0.1227433 -0.0044505 0.0027118 0.000184 -0.161401 -0.1114668 0.0004161 0.0026201 0.0909516 0.1227371 0.0044763 0.00272 -0.0001569 -0.1614003 -0.1865005 -0.2486143 -0.0101389 -0.1297838 -0.0505432 -0.0064364 -0.0117654 -0.012277 0.0303591 -0.1864727 0.2486251 -0.0101101 0.129796 -0.0505754 0.0064271 -0.0117461 0.012266 0.0303614 0.0261926 -0.0780779 0.0079679 -0.1110259 -0.0140356 -0.0055201 0.0080638 -0.0035926 -0.1525119 0.0262069 0.0780745 0.0079742 0.1110225 -0.0140514 0.0055315 0.0080716 0.0036043 -0.1525115 0.0639955 0.0711704 -0.0026527 0.0103036 -0.1229392 0.0011847 -0.0024955 0.0038693 0.1158639 0.0639895 -0.0711836 -0.0026596 -0.0103173 -0.1229328 -0.0012085 -0.002498 -0.0038949 0.1158633 0.0851866 -0.0428647 -0.0030676 0.0275887 -0.1046605 0.0013451 -0.0029923 -0.0020273 0.1523148 0.0851875 0.0428501 -0.0030636 -0.0276032 -0.1046624 -0.0013685 -0.0029942 0.0020034 0.1523147 0.0472591 -0.0181653 -0.0899697 -0.0164524 0.0645986 0.0284705 -0.0953715 -0.0222035 -0.0299504 0.0277493 -0.0196589 0.0961583 -0.0124756 0.0643517 -0.0305752 0.1015841 0.0197069 -0.0108241 0.0395143 0.1632512 -0.003659 0.0120667 -0.1125426 0.0013399 -0.0030516 0.0089798 0.1003252 0.0395008 -0.163262 -0.003676 -0.012078 -0.112527 -0.0013626 -0.0030527 -0.009002 0.1003243 0.0277539 0.0196501 0.0961623 0.0124679 0.0643475 0.0305766 0.1015838 -0.0197064 -0.0108249 0.0472599 0.0181773 -0.089971 0.0164639 0.0645972 -0.028453 -0.0953694 0.0222216 -0.0299493 -0.0799458 0.0834927 -0.0113294 0.0998253 0.0408805 0.0046546 -0.0112899 0.0038777 0.1623341 -0.0799597 -0.0834824 -0.0113369 -0.0998152 0.0408951 -0.0046645 -0.0112985 -0.0038878 0.1623333 unknown
polarizability: 253.1271429|-0.0041801|154.9075725|9.1221126|0.0040836|65.209549 unknown
InChI: InChI=1S/C13H12O/c1-9-7-11-5-3-4-6-12(11)8-10(2)13(9)14/h3-8H,1-2H3
charge 0 multiplicity 1
26 atoms
O  -3.521735 0.000212 -0.316175
C  0.990733 -0.720739 -0.085692
C  0.990787 0.720801 -0.085625
C  -1.544614 -1.317999 -0.208713
C  -1.544515 1.318265 -0.208581
C  -0.186193 -1.57075 -0.140556
C  -0.186074 1.570906 -0.140406
C  -2.236974 0.000161 -0.247075
C  2.251126 -1.398944 -0.026875
C  2.251232 1.398904 -0.026748
C  -2.500023 -2.496534 -0.25335
C  -2.499834 2.496878 -0.253075
C  3.470303 -0.710364 0.029549
C  3.470357 0.710226 0.029613
H  0.069099 -2.6414 -0.125521
H  0.069297 2.641536 -0.125262
H  2.250402 -2.495374 -0.026955
H  2.250593 2.495335 -0.026728
H  -3.124039 -2.454112 -1.16452
H  -3.212958 -2.448328 0.58982
H  -1.961676 -3.458641 -0.222771
H  -1.961414 3.45894 -0.222394
H  -3.212764 2.448632 0.590097
H  -3.123863 2.454604 -1.164243
H  4.414376 -1.263286 0.073337
H  4.414472 1.263073 0.073449
