program: Gaussian 09
title: 000137581
version: EM64L-G09RevD.01
frameworkgroup: C1[X(C10H7F7)]
method: RPBEPBE
basis: SDD
operation: Freq
keyword: #pfreq=noraman
keyword: PBEPBE/SDD
title: #p freq=noraman PBEPBE/SDD
converged: YES YES NO NO
title: Mulliken charges:
elementType: F F F F F F F C C C C C C C C C C H H H H H H H
charge: -0.170599 -0.128372 -0.146564 -0.123152 -0.145454 -0.128619 -0.123983 -0.024881 0.312918 0.364936 0.367541 -0.305179 -0.346118 0.444079 -0.385097 -0.373708 -0.801011 0.259640 0.269764 0.239591 0.240712 0.230132 0.230418 0.243005
chargesum: 0.00000
title: Mulliken charges with hydrogens summed into heavy atoms:
elementType: F F F F F F F C C C C C C C C C C
charge: -0.170599 -0.128372 -0.146564 -0.123152 -0.145454 -0.128619 -0.123983 -0.024881 0.312918 0.364936 0.367541 -0.045539 -0.076354 0.444079 -0.145505 -0.132996 -0.097456
polarizability: 1.48295128e+02 -5.30674524e-01 6.94222009e+01 -2.39164360e+00 -2.00800561e+00 1.06316667e+02
1716.lowfreq: -30.2246 -9.1645 -4.8429 -0.0004 0.0008 0.0009 5.9507 10.7506 40.6345
frequency: -29.7898 5.6491 40.5692 64.7721 66.9796 130.2465 147.3178 155.4620 225.1742 228.3990 265.1450 267.7263 293.1915 304.2144 317.1339 340.7523 360.2467 401.0186 433.8585 460.5358 478.2233 482.5871 512.4828 556.8748 581.1607 625.9837 635.5612 659.9957 721.7639 787.8223 817.8489 852.8384 898.1323 905.0761 963.2464 981.4402 986.7628 1008.8769 1009.9471 1021.0486 1029.5226 1048.4299 1066.7181 1098.7596 1139.0881 1160.0777 1178.9708 1205.1741 1222.6258 1230.3984 1317.6682 1371.4755 1399.0047 1409.0852 1469.4390 1473.4274 1505.3980 1583.6846 1624.3365 2980.3007 3062.7815 3092.3749 3135.3570 3137.8382 3175.9619 3181.8952
redmass: 1.0215 6.1290 7.7680 8.2462 8.4644 11.6642 8.4198 4.9521 15.6506 7.7734 14.4872 10.1374 16.1434 18.0808 6.5998 4.7795 3.8883 2.8875 10.9844 17.8123 13.5392 9.3495 3.4852 11.8152 6.9590 11.0736 7.0212 14.8130 3.4782 5.0823 1.4548 1.2554 7.5190 8.7793 1.3642 1.4432 1.6661 8.8175 3.8799 3.3539 10.5512 1.5896 12.1483 11.5746 1.5489 4.8202 11.7468 1.2352 3.7766 2.8582 1.2774 5.4824 1.2191 3.2099 1.0969 1.0558 2.5073 6.1859 6.2805 1.0390 1.0946 1.1001 1.0900 1.0903 1.0943 1.0948
irintensity: 0.5753 0.0180 0.2154 0.1242 0.0650 1.3562 0.5929 0.0906 1.4298 3.1983 0.3326 1.6910 0.3009 0.0019 1.3690 4.0765 1.9753 0.0403 2.9411 5.7540 6.2949 1.9829 7.3241 0.1814 10.8282 53.3809 0.2216 8.1149 1.7135 7.2459 86.6697 0.8363 112.0117 112.9016 1.8321 2.2057 4.9838 29.4435 26.7515 19.2134 13.0633 20.7923 347.6421 238.5847 32.1699 158.2325 155.1052 2.4594 5.3142 0.6414 0.2566 0.3739 14.9245 4.6501 16.7369 13.7253 16.9736 0.2078 21.8817 22.1518 18.9957 15.3309 13.5914 10.0298 2.2433 1.2485
temp: 298.150 k
press: 1.00000 atm
elementType: 9 9 9 9 9 9 9 6 6 6 6 6 6 6 6 6 6 1 1 1 1 1 1 1
symmnumber: 1
zpe: 396537.3 jmol-1
zpe.correction: 0.151033 hartree
zpe.thermalcorrener: 0.166391 hartree
zpe.thermalcorrenthalpy: 0.167336 hartree
zpe.thermalcorrgfe: 0.105922 hartree
zpe.sumelectzpe: -1082.894602 hartree
zpe.sumelectthermal: -1082.879244 hartree
zpe.sumelectthermalent: -1082.878300 hartree
zpe.sumelectthermalfe: -1082.939713 hartree
dipole: -4.5871 0.0423 0.3797
dipole: 4.6030
quadrupole: -86.1260 -102.3625 -91.8823
quadrupole: -0.3404 0.5330 -0.5431
quadrupole: 7.3310 -8.9056 1.5746 -0.3404 0.5330 -0.5431
hfenergy: -1083.0456354 hartree
pointgroup: C01 [X(C10H7F7)]
dipole: -1.8041931 -0.0156145 -0.1555302 debye
dipolederiv: -0.3887268 0.0040342 -0.0899869 0.0059686 -0.2798811 0.0097928 -0.1346 0.0085614 -0.5153804 -0.4300498 0.0863182 0.0875399 0.1213429 -0.674845 -0.1851238 0.1084669 -0.1248342 -0.3238038 -0.3499617 -0.0501246 0.0139708 -0.0799717 -0.3406613 0.1140733 -0.0449494 0.005332 -0.7103922 -0.9410464 -0.0372203 -0.1101762 -0.2104108 -0.3394388 -0.0066884 -0.0964831 0.0204034 -0.2667241 -0.3496485 0.0487249 0.0035082 0.0804413 -0.3327519 -0.0901476 -0.0509107 0.0159568 -0.7138399 -0.4229132 -0.0909365 0.0816377 -0.1239726 -0.6926659 0.158956 0.1031832 0.0984559 -0.3081608 -0.9531484 0.0461384 -0.0954902 0.2226184 -0.3393613 -0.0017956 -0.0591256 -0.0282691 -0.2638454 0.609985 -0.0050072 0.1048473 -0.0069522 0.1979472 -0.0094028 0.1900189 -0.0097489 0.4673 -0.1726149 -0.0044281 -0.0389958 -0.0074239 -0.1529768 -0.0049467 0.0446506 -0.0062233 -0.0791068 1.6013993 0.0300076 0.0258731 0.1783164 1.3746799 0.1026623 -0.0094662 0.0313634 1.2548273 1.5995767 -0.0327357 0.0227069 -0.1828002 1.3800514 -0.0856984 -0.0394608 -0.0110769 1.2425377 0.0535757 0.0070936 -0.0729436 -0.0161359 -0.0909078 -0.0098056 0.0855005 -0.0114961 0.0095309 0.0259807 -0.0040728 0.0699016 0.0058999 -0.0920795 -0.0085336 -0.1184173 -0.0054327 0.0308947 0.5173897 0.0209048 0.0561507 0.0842227 -0.0091249 0.0063005 0.0508453 0.0008779 0.0106993 -0.2533198 -0.0079866 0.0795404 -0.0195504 -0.1575829 -0.0123044 0.1587438 -0.0101558 0.0892566 -0.1796234 0.0114767 -0.1459718 0.0086167 -0.1512097 -0.0200522 -0.1984168 -0.0214382 0.0335541 -0.1985137 -0.018418 -0.0297794 -0.1377223 0.0521602 -0.0148685 -0.0407764 -0.003348 0.0727659 0.064143 -0.0030885 0.0701776 -0.0017452 0.1521106 0.0091857 0.0755815 0.0098533 0.0348887 0.1031803 0.0044295 -0.0542508 0.0062522 0.1516527 0.0098596 -0.0475929 0.0101917 0.0113454 0.0342157 0.0086655 -0.079126 0.0109111 0.1487518 0.0188188 -0.077546 0.0142668 -0.0561371 -0.0068007 -0.0047969 0.0955886 -0.0017643 0.1502724 0.0103229 0.0902583 0.014766 -0.021838 0.0121442 0.0278153 0.0317046 0.0766058 0.0798078 -0.0585641 0.1102969 -0.0843919 -0.057417 0.0375761 0.0105407 -0.0097453 0.0751018 0.0520936 0.0937339 -0.0789865 0.1083492 -0.0542093 -0.0127992 -0.047334 -0.0166814 -0.0878485 -0.0860407 -0.0257741 -0.0208141 -0.0219627 0.1132544 unknown
polarizability: 148.2780307|0.5749098|69.5153476|2.5404507|-2.7195926|106.2406179 unknown
InChI: InChI=1S/C10H7F7/c1-6-2-4-7(5-3-6)8(11,9(12,13)14)10(15,16)17/h2-5H,1H3
charge 0 multiplicity 1
24 atoms
F  1.299554 -0.078849 1.808488
F  1.050601 2.41468 0.503908
F  1.570107 1.462036 -1.490056
F  3.031551 1.363011 0.237525
F  1.505876 -1.354978 -1.607956
F  1.037134 -2.445947 0.326445
F  3.018477 -1.389047 0.078045
C  0.983159 -0.015377 0.395459
C  -0.529734 0.000819 0.200565
C  1.670634 1.306439 -0.091635
C  1.648674 -1.301337 -0.205928
C  -1.106507 0.097337 -1.090495
C  -1.367702 -0.085153 1.336885
C  -3.365445 0.018308 -0.103123
C  -2.508732 0.107028 -1.230252
C  -2.768561 -0.073789 1.179711
C  -4.873143 -0.002036 -0.268426
H  -0.479145 0.167139 -1.983266
H  -0.927576 -0.156282 2.334653
H  -2.943506 0.185784 -2.233219
H  -3.406576 -0.136854 2.068692
H  -5.384418 0.42343 0.612355
H  -5.191646 0.566483 -1.15927
H  -5.240277 -1.039342 -0.392304
