program: Gaussian 09
title: 000137578
version: EM64L-G09RevD.01
frameworkgroup: C1[X(C14H6F8N2)]
method: RPBEPBE
basis: SDD
operation: Freq
keyword: #p
keyword: freq=noraman
keyword: PBEPBE/SDD
title: #p freq=noraman PBEPBE/SDD
converged: YES YES NO NO
title: Mulliken charges:
elementType: F F F F F F F F N N C C C C C C C C C C C C C C H H H H H H
charge: -0.161547 -0.161641 -0.162719 -0.162587 -0.134379 -0.134203 -0.136055 -0.135795 -0.030247 -0.029851 0.233127 0.234690 -0.101793 -0.104092 0.103841 0.102196 0.092402 0.092059 0.204088 0.205265 0.083698 0.085305 -0.757525 -0.757911 0.256885 0.254478 0.255282 0.254589 0.256937 0.255502
chargesum: 0.00000
title: Mulliken charges with hydrogens summed into heavy atoms:
elementType: F F F F F F F F N N C C C C C C C C C C C C C C
charge: -0.161547 -0.161641 -0.162719 -0.162587 -0.134379 -0.134203 -0.136055 -0.135795 -0.030247 -0.029851 0.233127 0.234690 -0.101793 -0.104092 0.103841 0.102196 0.092402 0.092059 0.204088 0.205265 0.083698 0.085305 0.009121 0.009118
polarizability: 4.14918846e+02 -3.75383484e-01 1.65819367e+02 2.14413456e+00 1.05175073e-01 8.87648274e+01
1716.lowfreq: -5.3799 -2.7062 -0.0006 0.0003 0.0005 2.0704 8.6666 11.9077 14.7955
frequency: 7.7503 11.2836 14.0161 29.7288 33.7264 73.3408 105.3218 115.4530 117.4759 141.9781 144.8712 159.6134 164.9469 188.1468 194.2909 254.4563 264.3743 265.2823 276.6536 278.0724 289.7583 290.9764 316.1070 331.8537 336.1095 385.8796 388.2839 390.6104 415.8504 425.8626 428.5901 433.0401 466.9146 534.1744 553.4704 576.3177 609.0701 620.0022 643.0305 643.4135 665.5038 717.5501 749.9317 764.3674 785.2191 865.6997 891.9022 922.6092 951.4936 1039.5380 1040.8561 1042.7133 1043.7129 1069.4331 1077.8776 1080.5832 1103.8264 1225.0782 1247.0481 1331.9604 1342.5973 1355.4894 1361.9227 1377.7032 1400.5236 1402.3229 1430.1978 1433.3006 1437.3195 1438.0744 1461.7483 1461.9725 1468.0698 1469.0492 1566.7269 1569.3944 1618.6240 1621.3729 2997.3845 2997.9202 3084.2483 3084.8183 3122.9493 3123.6641
redmass: 2.5204 1.0340 1.5752 6.3854 8.4892 8.5794 10.6694 18.1257 16.6059 6.1813 6.2075 9.6667 9.7272 10.5698 10.1784 9.7080 3.0564 3.0810 17.1172 17.1320 17.2703 17.1595 11.8145 11.0453 9.3658 12.5418 12.5009 10.3954 8.3520 12.7324 11.8707 13.1400 15.1604 9.0062 7.3452 12.0862 6.2795 8.1141 12.1058 12.1396 7.1003 5.6086 6.5137 8.8558 10.0881 6.6801 5.6197 9.2848 7.5955 1.8161 1.5070 2.9823 2.4981 4.8944 3.1600 4.0730 9.1017 10.1586 10.6320 12.4919 11.6680 11.2860 9.4412 10.2707 1.4852 1.3906 3.7368 4.1772 4.3349 4.5839 1.0743 1.0767 1.3542 1.3494 6.7303 6.9587 11.2188 11.2381 1.0404 1.0404 1.0927 1.0927 1.1011 1.1012
irintensity: 0.1730 0.3651 0.2384 1.3290 1.5526 0.1786 0.7462 0.2854 0.1861 10.0597 3.7838 0.4281 16.3277 0.9005 2.8149 0.3949 1.8139 1.5855 0.1901 0.0279 0.3206 1.6600 7.0171 0.4795 6.2516 0.0763 7.2369 3.2908 3.2252 1.3259 7.5644 0.2469 0.0703 6.4337 0.0857 30.8571 7.9391 3.5149 3.1315 0.9215 0.6786 1.5260 1.3229 2.0534 0.2364 11.1249 147.4602 37.3332 9.8817 2.8984 20.7485 67.4106 12.4970 8.3292 57.0661 2.5858 28.2999 0.1223 142.5234 3.0551 254.5527 1.3157 12.1479 1.2870 0.6112 21.0337 25.8291 298.8342 20.6812 24.8491 16.7237 18.2696 158.0955 42.4182 7.1710 0.3450 0.2989 47.4541 4.6615 4.5182 8.5426 8.7039 2.4655 2.4463
temp: 298.150 k
press: 1.00000 atm
elementType: 9 9 9 9 9 9 9 9 7 7 6 6 6 6 6 6 6 6 6 6 6 6 6 6 1 1 1 1 1 1
symmnumber: 1
zpe: 455564.3 jmol-1
zpe.correction: 0.173515 hartree
zpe.thermalcorrener: 0.196397 hartree
zpe.thermalcorrenthalpy: 0.197341 hartree
zpe.thermalcorrgfe: 0.116122 hartree
zpe.sumelectzpe: -1443.521498 hartree
zpe.sumelectthermal: -1443.498617 hartree
zpe.sumelectthermalent: -1443.497673 hartree
zpe.sumelectthermalfe: -1443.578892 hartree
dipole: -0.0180 -0.0424 0.2893
dipole: 0.2929
quadrupole: -93.1781 -153.5817 -131.2204
quadrupole: 5.1060 0.7903 0.0537
quadrupole: 32.8153 -27.5883 -5.2270 5.1060 0.7903 0.0537
hfenergy: -1443.6950138 hartree
pointgroup: C01 [X(C14H6F8N2)]
dipole: 0.0069588 -0.1138943 0.016143 debye
polarizability: 414.9218427|1.7184577|88.7604135|-0.8047245|-0.249033|165.8207842 unknown
InChI: InChI=1S/C14H6F8N2/c1-3-5(15)9(19)13(10(20)6(3)16)23-24-14-11(21)7(17)4(2)8(18)12(14)22/h1-2H3
charge 0 multiplicity 1
30 atoms
F  -4.312503 -0.887587 -2.377702
F  4.317356 -0.929829 2.360581
F  -4.900825 0.844521 2.095695
F  4.89691 0.841366 -2.098614
F  -1.611206 -0.810829 -2.09332
F  1.615099 -0.836293 2.087881
F  -2.181273 0.944886 2.425722
F  2.177423 0.959434 -2.416789
N  -0.409161 0.142879 0.516211
N  0.408251 0.153546 -0.50934
C  -4.67375 -0.019483 -0.152169
C  4.673935 -0.03547 0.144706
C  -1.78699 0.100027 0.178854
C  1.786647 0.09681 -0.175855
C  -3.78244 -0.414818 -1.172499
C  3.784571 -0.440662 1.163012
C  -4.077191 0.432978 1.043981
C  4.075388 0.42721 -1.046338
C  -2.384529 -0.355735 -1.036189
C  2.386412 -0.374102 1.032483
C  -2.685132 0.484814 1.219124
C  2.682938 0.487476 -1.215692
C  -6.171991 -0.087715 -0.322788
C  6.17241 -0.090235 0.318896
H  -6.558954 -1.06757 0.015134
H  -6.670077 0.689613 0.27804
H  -6.453291 0.032394 -1.380809
H  6.673613 -0.257718 -0.647468
H  6.551657 0.864717 0.729096
H  6.456903 -0.888924 1.021756
