program: Gaussian 09
title: 000137560
version: EM64L-G09RevD.01
frameworkgroup: C1[X(C6H2Cl2F2)]
method: RPBEPBE
basis: SDD
operation: Freq
keyword: #p
keyword: freq=noraman
keyword: PBEPBE/SDD
title: #p freq=noraman PBEPBE/SDD
converged: NO YES NO YES
title: Mulliken charges:
elementType: Cl Cl F F C C C C C C H H
charge: 0.020591 0.020591 -0.152666 -0.190657 0.510850 -0.214080 -0.214084 -0.378047 -0.378052 0.390552 0.292501 0.292501
chargesum: 0.00000
title: Mulliken charges with hydrogens summed into heavy atoms:
elementType: Cl Cl F F C C C C C C
charge: 0.020591 0.020591 -0.152666 -0.190657 0.510850 -0.214080 -0.214084 -0.085546 -0.085551 0.390552
polarizability: 1.15490916e+02 6.08695730e-05 9.56186470e+01 -8.09255333e-03 1.82163152e-03 3.09294228e+01
1716.lowfreq: -6.7582 -1.4823 -0.0029 -0.0021 0.0021 6.5966 100.8893 165.3824 177.5212
frequency: 100.8893 165.3781 177.5212 197.4706 216.9895 284.5930 353.2327 360.2283 425.0589 448.5448 498.3829 556.2180 578.0258 700.1038 733.8184 768.1731 840.9124 852.4871 907.9735 1039.8314 1162.3605 1179.3745 1262.1257 1367.4870 1388.0781 1448.5937 1587.1929 1592.9893 3192.7385 3193.5842
redmass: 21.5386 13.5533 23.5258 5.0452 19.7250 21.1993 8.7626 21.5215 7.7520 16.3213 5.1113 6.5889 3.7702 5.7445 7.4620 11.4333 1.3444 1.5367 10.0029 2.7388 2.1807 1.4036 9.4810 9.5684 4.4980 4.3884 9.7148 7.9522 1.0937 1.0941
irintensity: 0.3788 0.9530 0.0345 0.0000 0.0794 0.8188 1.5044 0.6479 7.8297 0.0292 0.0000 1.9432 3.9143 11.8258 52.7250 79.9884 0.0000 60.1687 37.5153 0.4832 46.8628 2.3388 2.1245 8.5850 18.5773 198.9798 85.5906 58.2817 5.8995 0.6161
temp: 298.150 k
press: 1.00000 atm
elementType: 17 17 9 9 6 6 6 6 6 6 1 1
symmnumber: 1
zpe: 164967.2 jmol-1
zpe.correction: 0.062833 hartree
zpe.thermalcorrener: 0.071589 hartree
zpe.thermalcorrenthalpy: 0.072534 hartree
zpe.thermalcorrgfe: 0.028008 hartree
zpe.sumelectzpe: -1348.912580 hartree
zpe.sumelectthermal: -1348.903823 hartree
zpe.sumelectthermalent: -1348.902879 hartree
zpe.sumelectthermalfe: -1348.947404 hartree
dipole: 0.0000 1.4474 0.0001
dipole: 1.4474
quadrupole: -66.1384 -76.1111 -69.9513
quadrupole: 0.0002 -0.0001 0.0001
quadrupole: 4.5952 -5.3775 0.7823 0.0002 -0.0001 0.0001
hfenergy: -1348.9754122 hartree
pointgroup: C01 [X(C6H2Cl2F2)]
dipole: -0.5694639 -0.0001259 0.0000298 debye
dipolederiv: -0.2069764 0.2525253 -0.0000223 0.2590459 -0.5532221 0.0000428 -0.0000087 0.0000271 -0.0097074 -0.2067457 -0.2523725 0.0000394 -0.2588879 -0.553452 0.0000785 0.0000581 0.0000927 -0.0097072 -0.88565 -0.0001719 0.000032 -0.0001729 -0.1349411 0.0000028 0.0000597 0.0000088 -0.098226 -1.1046734 -0.0002027 -0.0000269 -0.0002058 -0.2297228 0.0000075 -0.0001718 -0.0000016 -0.1438776 0.8541396 0.0002777 -0.0000347 0.0002707 -0.3356598 0.0000493 -0.0000643 0.0000516 0.1224111 0.3691902 -0.2817708 0.0000251 -0.4559787 0.9101974 -0.0000612 0.0000428 -0.0000732 -0.0634428 0.3688534 0.2815216 -0.0000724 0.455736 0.9105269 -0.0001606 -0.0000846 -0.0001581 -0.0634445 -0.3218567 0.0484026 -0.0000167 0.2223684 -0.2570309 0.0000294 -0.000044 0.0000069 -0.1149825 -0.3217301 -0.0484317 0.0000003 -0.222398 -0.2571544 0.0000152 -0.0000037 0.0000323 -0.1149822 1.2632688 0.0002063 0.0000757 0.0002057 0.379946 -0.0000237 0.0002265 -0.0000151 0.1091131 0.0961014 -0.0214825 0.0000002 -0.0303019 0.0602442 0.0000014 -0.0000051 0.0000032 0.1934224 0.0960791 0.0214985 0.0000002 0.0303185 0.0602684 0.0000187 -0.0000048 0.0000254 0.1934235 unknown
polarizability: 95.618648|-0.0044035|115.4909152|-0.0018199|-0.008093|30.9294228 unknown
InChI: InChI=1S/C6H2Cl2F2/c7-4-1-3(9)2-5(8)6(4)10/h1-2H
charge 0 multiplicity 1
12 atoms
Cl 1.297336 -2.772075 0.00025
Cl 1.296079 2.772663 -0.000348
F  2.475017 0.000575 -0.000065
F  -3.097703 -0.000717 -0.000073
C  1.082787 0.000252 0.000039
C  0.377827 -1.222009 0.000161
C  0.377262 1.222187 -0.000059
C  -1.030115 -1.238195 0.000149
C  -1.03069 1.237728 0.0000
C  -1.696568 -0.000387 0.000136
H  -1.590365 -2.175872 0.000137
H  -1.591365 2.175149 -0.000127
