program: Gaussian 09
title: 000137558
version: EM64L-G09RevD.01
frameworkgroup: C1[X(C2H2BrF)]
method: RPBEPBE
basis: SDD
operation: Freq
keyword: #p
keyword: freq=noraman
keyword: PBEPBE/SDD
title: #p freq=noraman PBEPBE/SDD
converged: NO YES NO YES
title: Mulliken charges:
elementType: Br F C C H H
charge: 0.049109 -0.189434 -0.429673 0.050059 0.283297 0.236642
chargesum: 0.00000
title: Mulliken charges with hydrogens summed into heavy atoms:
elementType: Br F C C
charge: 0.049109 -0.189434 -0.146376 0.286701
polarizability: 6.04496322e+01 -2.95120858e-01 2.57640719e+01 1.12055101e-03 1.52947175e-04 1.29408903e+01
1716.lowfreq: -14.1217 -4.5238 0.0007 0.0008 0.0011 8.5798 224.4061 230.1365 345.4874
frequency: 224.4058 230.1358 345.4874 738.8598 753.9681 904.9987 1025.7982 1182.7683 1276.6876 1625.9627 3192.3430 3213.8544
redmass: 6.0517 7.5238 15.4714 4.9076 1.8299 1.0937 7.6157 1.1617 1.1507 6.6774 1.0948 1.0984
irintensity: 4.1205 0.8799 2.5252 45.3524 9.9648 115.5084 132.8934 4.3230 2.8312 19.0965 7.1736 8.7836
temp: 298.150 k
press: 1.00000 atm
elementType: 35 9 6 6 1 1
symmnumber: 1
zpe: 88016.9 jmol-1
zpe.correction: 0.033524 hartree
zpe.thermalcorrener: 0.038071 hartree
zpe.thermalcorrenthalpy: 0.039016 hartree
zpe.thermalcorrgfe: 0.005014 hartree
zpe.sumelectzpe: -190.361603 hartree
zpe.sumelectthermal: -190.357056 hartree
zpe.sumelectthermalent: -190.356112 hartree
zpe.sumelectthermalfe: -190.390113 hartree
dipole: -0.4325 -0.3354 0.0000
dipole: 0.5473
quadrupole: -36.7173 -28.4915 -33.5955
quadrupole: -0.7493 0.0000 0.0001
quadrupole: -3.7825 4.4433 -0.6608 -0.7493 0.0000 0.0001
hfenergy: -190.3951273 hartree
pointgroup: C01 [X(C2H2Br1F1)]
dipole: -0.1645836 -0.1388278 -0.000008 debye
dipolederiv: -0.4279872 -0.0389755 -0.0000124 -0.172302 -0.0763851 -0.0000056 -0.0000183 -0.0000023 0.0006622 -1.1420657 0.0003386 -0.0000087 -0.2710498 -0.2467233 -0.0000038 0.0000154 -0.0000026 -0.1260782 0.5550188 0.1494495 0.0000343 0.4004047 -0.0228791 0.0000089 0.0000405 0.0000016 -0.3266788 1.0121167 -0.011852 -0.0000057 0.1519382 0.343341 0.0000093 -0.0000351 0.0000155 -0.0386853 -0.0366328 -0.0800398 -0.0000086 -0.0597015 0.0222437 -0.0000027 -0.0000092 0. 0.2650435 0.0395502 -0.0189208 0.0000011 -0.0492896 -0.0195973 -0.0000062 0.0000067 -0.0000121 0.2257366 unknown
polarizability: 60.4152375|1.1308909|25.7984667|0.0011133|0.0001989|12.9408903 unknown
InChI: InChI=1S/C2H2BrF/c3-1-2-4/h1-2H
charge 0 multiplicity 1
6 atoms
Br -2.217845 -0.167181 -0.000051
F  1.971068 0.089087 0.000012
C  -0.381925 0.463708 0.000012
C  0.652968 -0.399949 0.000021
H  -0.273538 1.54975 0.000018
H  0.602573 -1.492315 -0.000012
