program: Gaussian 09
title: 000137545
version: EM64L-G09RevD.01
frameworkgroup: C1[X(C10H10)]
method: RPBEPBE
basis: SDD
operation: Freq
keyword: #p
keyword: freq=noraman
keyword: PBEPBE/SDD
title: #p freq=noraman PBEPBE/SDD
converged: YES YES NO NO
title: Mulliken charges:
elementType: C C C C C C C C C C H H H H H H H H H H
charge: 0.483496 -0.420963 -0.394888 -0.231155 -0.213878 -0.249198 -0.407205 0.135888 -0.273436 -0.708021 0.226018 0.238167 0.224826 0.223656 0.227441 0.223407 0.226830 0.236105 0.227475 0.225435
chargesum: 0.00000
title: Mulliken charges with hydrogens summed into heavy atoms:
elementType: C C C C C C C C C C
charge: 0.483496 -0.194944 -0.156721 -0.006329 0.009778 -0.021757 -0.183798 0.135888 -0.046606 -0.019007
polarizability: 1.89194920e+02 8.06452877e+00 1.01500675e+02 -8.90117512e+00 -4.00115721e+00 5.34835911e+01
1716.lowfreq: -10.2468 -3.5836 -0.0005 0.0004 0.0005 8.2342 50.8598 72.4850 134.9412
frequency: 50.8255 72.4654 134.9390 169.7953 172.8861 295.9893 317.1242 405.1850 412.2988 504.6468 542.5001 615.8110 623.7502 697.8829 727.8486 795.0085 803.6070 850.9695 884.1822 902.7109 931.9157 978.1038 988.5123 994.6717 1025.0426 1032.6157 1064.0616 1081.2253 1125.0438 1170.9660 1186.6808 1215.7080 1273.5969 1324.5845 1377.3907 1384.7689 1407.6832 1449.5535 1466.0389 1474.2898 1488.9662 1587.9635 1610.9556 1991.6538 2974.3216 3052.4174 3063.0812 3066.4018 3105.6645 3116.1060 3122.4067 3135.0995 3145.3334 3162.7819
redmass: 3.4729 3.7201 1.2702 2.9124 2.1365 3.4829 3.9349 2.9450 5.2796 2.7011 3.4918 6.4165 5.4759 1.9282 1.3150 1.7323 5.0207 1.2493 2.4155 1.2049 1.5088 1.3865 6.2361 1.3229 2.2097 1.4431 1.7252 1.6604 1.9877 1.0568 1.1130 1.6342 1.4384 1.3238 4.5910 1.2267 2.8041 2.0779 1.0474 1.1923 2.3389 6.0013 6.0342 10.7266 1.0363 1.0983 1.0874 1.0867 1.0993 1.0866 1.0863 1.0914 1.0963 1.1015
irintensity: 0.3605 0.7585 1.0316 0.2969 1.4476 3.8249 0.5086 0.1884 1.3257 15.6729 7.0895 0.0230 23.4979 41.3096 36.4091 46.3545 1.2407 0.5848 12.3466 18.1717 24.1339 0.2970 0.0872 0.6119 4.8899 0.2123 3.8544 11.1827 2.4270 0.1336 0.1919 0.9947 11.2339 3.2071 2.5796 7.3418 3.9920 5.5908 13.1078 15.0725 18.9871 1.0987 13.6389 22.6495 48.1574 24.2307 8.4917 11.7561 26.9504 9.0485 0.5761 10.2007 43.3213 28.4602
temp: 298.150 k
press: 1.00000 atm
elementType: 6 6 6 6 6 6 6 6 6 6 1 1 1 1 1 1 1 1 1 1
symmnumber: 1
zpe: 428000.1 jmol-1
zpe.correction: 0.163017 hartree
zpe.thermalcorrener: 0.172479 hartree
zpe.thermalcorrenthalpy: 0.173424 hartree
zpe.thermalcorrgfe: 0.127708 hartree
zpe.sumelectzpe: -386.305896 hartree
zpe.sumelectthermal: -386.296434 hartree
zpe.sumelectthermalent: -386.295489 hartree
zpe.sumelectthermalfe: -386.341205 hartree
dipole: 0.6696 0.2779 0.1680
dipole: 0.7442
quadrupole: -49.2300 -53.8515 -63.1764
quadrupole: 2.0429 -0.9245 -1.1614
quadrupole: 6.1893 1.5678 -7.7571 2.0429 -0.9245 -1.1614
hfenergy: -386.4689129 hartree
pointgroup: C01 [X(C10H10)]
dipole: -0.2552783 -0.1350519 0.0480934 debye
dipolederiv: 0.4476314 -0.0758959 -0.01333 -0.1317581 -0.0434359 -0.0410665 -0.0368136 -0.0405189 0.0489802 -0.2309536 -0.0152376 0.000562 0.0140897 0.0768202 0.0937162 0.0046463 0.0947714 -0.1548349 -0.1209346 0.0613245 0.0290424 0.142005 -0.0653249 0.038385 0.0594217 0.0369573 -0.1431137 0.1244569 0.0614395 0.0340033 0.0990205 -0.0013144 0.0600629 0.0497445 0.0580687 -0.1255845 -0.046714 -0.0134298 0.0000207 -0.0685386 0.112262 0.094889 -0.0207555 0.0947146 -0.1112735 -0.0269204 -0.0586646 -0.0091337 -0.0015832 -0.0765844 0.03544 0.0056625 0.0352749 -0.166693 -0.1081806 -0.0780323 -0.0095957 -0.3121811 0.1195772 0.1242723 -0.1086817 0.105051 -0.1415496 0.2706511 0.1869211 0.1153579 0.4122813 -0.0966839 0.057933 0.2323391 0.0699275 -0.1511884 -0.133156 0.1183985 0.0115715 0.0845128 -0.1174393 -0.13177 -0.0672558 -0.1504992 0.1588688 -0.046743 -0.0733495 0.031653 -0.0538746 0.0675658 0.0590013 -0.1020661 0.0227887 0.0112463 0.0911332 0.0608967 0.0173472 0.0251965 -0.0869692 -0.0891341 0.0055979 -0.0864182 0.124889 -0.0047659 -0.0907445 -0.043746 -0.0805288 0.0398548 -0.0375543 -0.0387003 -0.0414707 0.1267886 -0.0799246 -0.0968903 -0.0450727 -0.1067168 0.0272927 -0.0533013 -0.0508557 -0.0531137 0.1364907 0.0661866 0.0219926 0.0049888 0.0562664 -0.0955161 -0.0925197 0.01672 -0.0918583 0.1215471 -0.1131298 0.0755197 0.0162484 0.0840088 0.0664962 -0.0327861 0.0181764 -0.0326312 0.1532399 -0.0014941 -0.0643125 -0.0203994 0.0146564 -0.065577 -0.0798855 -0.0031247 -0.0912018 0.1348571 -0.0302566 -0.0375268 -0.067121 -0.0969158 0.1313645 0.0404343 -0.0778927 0.0577417 -0.0758999 0.0743142 0.0050593 -0.1145643 -0.0084757 0.0919741 0.0042368 -0.0401396 0.0421116 -0.0871255 -0.1836119 0.0548853 0.0501051 0.0694681 0.0480252 0.0020401 0.1036289 0.0366798 0.0879251 0.0524117 -0.0423532 0.0120624 -0.140933 -0.1323876 -0.0523936 0.0503482 -0.0663753 0.0524302 unknown
polarizability: 189.0935926|10.6786563|97.1668534|3.8077009|15.308882|57.9187402 unknown
InChI: InChI=1S/C10H10/c1-2-3-7-10-8-5-4-6-9-10/h2,4-9H,1H3
charge 0 multiplicity 1
20 atoms
C  0.478331 0.406393 0.049021
C  1.620543 1.181843 0.390551
C  0.675627 -0.918137 -0.43347
C  2.921927 0.651805 0.255274
C  1.97498 -1.446516 -0.568299
C  3.105841 -0.66532 -0.224636
C  -0.870389 1.000787 0.207795
C  -2.03932 0.411727 -0.069473
C  -3.207658 -0.166796 -0.33106
C  -4.027959 -0.975761 0.664818
H  1.483588 2.204886 0.763253
H  -0.198432 -1.523567 -0.700815
H  3.790668 1.263764 0.523182
H  2.111403 -2.468081 -0.941564
H  4.114996 -1.078803 -0.330412
H  -0.892247 2.033891 0.59047
H  -3.635764 -0.060258 -1.341034
H  -3.52526 -1.038716 1.643564
H  -5.024158 -0.516369 0.810953
H  -4.193416 -2.00347 0.28838
