program: Gaussian 09
title: 000137535
version: EM64L-G09RevD.01
frameworkgroup: C1[X(C14H18F3NO)]
method: RPBEPBE
basis: SDD
operation: Freq
keyword: #p
keyword: freq=noraman
keyword: PBEPBE/SDD
title: #p freq=noraman PBEPBE/SDD
converged: YES YES NO NO
title: Mulliken charges:
elementType: F F F O N C C C C C C C C C C C C C C H H H H H H H H H H H H H H H H H H
charge: -0.161958 -0.169803 -0.170141 -0.238815 -0.459353 0.143825 -0.378818 -0.709543 -0.724013 -0.366620 0.160906 -0.692246 0.522959 -0.556501 -0.350233 0.345375 -0.192622 -0.405599 0.248807 0.207818 0.168864 0.226038 0.235996 0.193278 0.227903 0.202406 0.241283 0.216518 0.215219 0.305094 0.209596 0.223511 0.207567 0.250477 0.318319 0.237477 0.267030
chargesum: 0.00000
title: Mulliken charges with hydrogens summed into heavy atoms:
elementType: F F F O N C C C C C C C C C C C C C C
charge: -0.161958 -0.169803 -0.170141 -0.238815 -0.154259 0.143825 -0.002136 -0.054232 -0.052421 0.065117 0.160906 -0.051573 0.522959 -0.306023 -0.031914 0.345375 0.044855 -0.138569 0.248807
polarizability: 2.20691435e+02 -9.60809049e-01 1.49892503e+02 1.15984883e+01 1.83705473e+01 1.28833771e+02
1716.lowfreq: -24.4729 -11.9549 0.0011 0.0011 0.0012 3.2636 6.4723 11.7729 34.2576
frequency: -23.9406 10.1409 33.5354 58.2598 67.3669 79.5710 91.2291 129.0446 156.1678 163.3437 194.3330 204.9267 213.0566 237.1322 244.3719 266.8273 287.0361 302.1937 318.3338 325.6199 339.2087 363.3721 395.1152 430.0428 441.2561 451.2471 488.2632 518.9375 560.9768 607.3668 612.5721 614.0163 652.8762 695.5687 700.2226 725.2525 736.8255 814.2395 817.8780 858.7252 861.4732 882.6666 883.3838 919.4180 936.4782 939.9383 957.3336 979.7444 982.9508 1000.2209 1007.2909 1008.0186 1049.9620 1059.4325 1065.9548 1100.6694 1104.4853 1138.1669 1172.3406 1185.6920 1204.8828 1212.4511 1235.9086 1270.7997 1289.6674 1303.3074 1309.6012 1314.3899 1351.9682 1382.0563 1383.4917 1391.4902 1400.9148 1417.1542 1454.4502 1461.7898 1469.3850 1473.3394 1477.7748 1480.8465 1483.4562 1484.9818 1488.5491 1520.3234 1600.6134 1612.6911 1626.2139 2942.2186 2972.6054 2973.8488 2982.7745 2994.9364 3001.3921 3037.8086 3063.1639 3071.0927 3077.0771 3081.6256 3090.5847 3109.4862 3129.5427 3150.8206 3180.9964 3198.1404 3528.4273
redmass: 14.2046 4.1865 3.9648 7.6650 1.8851 3.8208 3.6344 6.1425 3.0974 4.2261 1.1260 2.6086 1.8589 1.2975 1.5577 4.4825 2.8635 6.5961 3.5827 2.9653 5.4969 3.8894 7.7829 4.6396 3.3008 3.1421 4.2737 9.8157 4.3415 6.9163 3.1664 4.5471 1.5894 2.1652 7.7859 4.3241 1.2365 1.3599 2.7620 4.7387 1.5132 1.6978 2.3464 2.5828 1.4056 1.4806 1.7513 9.2589 6.1433 1.3474 4.3100 1.3656 2.5524 1.8661 2.4000 2.1391 1.7441 2.5824 2.6866 1.0932 2.5306 2.0446 1.8623 1.6288 1.3946 1.2871 2.3624 1.7878 1.4814 2.5879 1.4579 1.2108 1.2125 3.6324 1.0575 1.0602 1.0724 1.0685 1.0428 1.1497 1.1488 2.0409 1.0971 2.0249 7.3559 4.6671 5.6304 1.0629 1.0361 1.0360 1.0630 1.0377 1.0928 1.1007 1.0980 1.1012 1.0990 1.1004 1.0992 1.0985 1.0922 1.0890 1.0950 1.0957 1.0755
irintensity: 0.1568 0.0078 0.0916 7.4367 0.2685 2.1463 1.9399 0.2147 0.1235 0.7156 0.0994 0.9690 1.1739 0.8460 0.6398 2.6147 0.0346 0.0046 0.5748 1.0833 6.5110 10.4969 2.4991 0.3970 1.2596 2.3349 9.4665 0.5955 9.4450 15.4141 20.5455 7.8327 35.4451 32.2958 3.1430 5.4113 9.6968 69.3820 3.3501 30.5755 3.2913 48.1209 5.0277 6.8478 4.5227 6.8162 4.9038 213.3085 18.1817 18.6733 136.3589 8.8305 6.3006 78.7221 108.0295 2.7982 0.9713 103.7379 4.8642 0.3589 9.7115 4.4847 82.3942 0.5813 10.3206 9.7674 189.1192 160.9946 0.8891 61.9237 7.6590 10.7157 31.1747 3.5663 1.5761 0.4023 6.5959 6.6088 18.6186 60.7350 24.6246 202.9319 23.7041 293.8949 25.6137 72.4051 77.4663 30.4618 29.7969 37.8565 21.0723 21.0654 32.9577 15.2763 42.4826 97.5310 40.0196 11.2998 46.1282 23.9910 5.1423 8.7973 2.3845 8.1036 12.1884
temp: 298.150 k
press: 1.00000 atm
elementType: 9 9 9 8 7 6 6 6 6 6 6 6 6 6 6 6 6 6 6 1 1 1 1 1 1 1 1 1 1 1 1 1 1 1 1 1 1
symmnumber: 1
zpe: 772375.6 jmol-1
zpe.correction: 0.294182 hartree
zpe.thermalcorrener: 0.313320 hartree
zpe.thermalcorrenthalpy: 0.314264 hartree
zpe.thermalcorrgfe: 0.245184 hartree
zpe.sumelectzpe: -972.380515 hartree
zpe.sumelectthermal: -972.361378 hartree
zpe.sumelectthermalent: -972.360434 hartree
zpe.sumelectthermalfe: -972.429514 hartree
dipole: 3.4451 0.6978 0.7644
dipole: 3.5972
quadrupole: -121.1815 -116.1300 -111.8420
quadrupole: 14.7417 9.5696 2.0228
quadrupole: -4.7970 0.2545 4.5425 14.7417 9.5696 2.0228
hfenergy: -972.6746976 hartree
pointgroup: C01 [X(C14H18F3N1O1)]
dipole: 1.3570479 -0.2617907 -0.3045801 debye
polarizability: 220.4996294|1.8050405|150.5852568|-12.4580259|17.80761|128.3328224 unknown
InChI: InChI=1S/C14H18F3NO/c1-4-8-13(2,3)12(19)18-11-7-5-6-10(9-11)14(15,16)17/h5-7,9,18H,4,8H2,1-3H3
charge 0 multiplicity 1
37 atoms
F  -5.145452 -0.485421 0.20527
F  -4.011381 -0.978871 -1.696862
F  -3.663626 -2.203533 0.170486
O  2.219221 1.974639 0.513916
N  0.909143 0.259982 -0.388449
C  3.355044 0.220541 -0.831161
C  3.509872 -1.243405 -0.293454
C  3.155211 0.177779 -2.376948
C  4.617374 1.057411 -0.513322
C  3.636685 -1.385154 1.24016
C  2.129672 0.912461 -0.167693
C  3.749662 -2.861264 1.678977
C  -0.387663 0.615133 0.066948
C  -1.462304 -0.235233 -0.296746
C  -0.64767 1.769066 0.859937
C  -2.775331 0.062753 0.125882
C  -1.967607 2.046231 1.269378
C  -3.043633 1.204941 0.912602
C  -3.879107 -0.868995 -0.281812
H  4.408769 -1.678171 -0.776973
H  2.655676 -1.866408 -0.639176
H  4.064877 -0.228477 -2.855742
H  2.979475 1.189852 -2.783728
H  2.307949 -0.465261 -2.683811
H  4.548552 2.0588 -0.971707
H  5.513024 0.546735 -0.912076
H  4.743587 1.209202 0.570467
H  4.524821 -0.828224 1.593943
H  2.76003 -0.919379 1.732584
H  0.957496 -0.591949 -0.951941
H  4.632123 -3.34691 1.221061
H  3.849722 -2.946391 2.776072
H  2.854949 -3.438389 1.377379
H  -1.278356 -1.127972 -0.906899
H  0.182065 2.420582 1.137955
H  -2.158046 2.93566 1.878667
H  -4.06432 1.42614 1.235014
