program: Gaussian 09
title: 000011587
version: EM64L-G09RevD.01
frameworkgroup: C1[X(C5H8)]
method: RPBEPBE
basis: SDD
operation: Freq
keyword: #p
keyword: freq=noraman
keyword: PBEPBE/SDD
title: #p freq=noraman PBEPBE/SDD
converged: YES YES NO NO
title: Mulliken charges:
elementType: C C C C C H H H H H H H H
charge: -0.527520 -0.017180 -0.017184 -0.573333 -0.573331 0.213731 0.210434 0.210399 0.210400 0.215495 0.216297 0.215495 0.216297
chargesum: 0.00000
title: Mulliken charges with hydrogens summed into heavy atoms:
elementType: C C C C C
charge: -0.103355 0.193220 0.193216 -0.141541 -0.141539
polarizability: 7.11815026e+01 -1.13008644e-04 4.99873332e+01 -2.21472287e-04 3.19034629e+00 3.62082528e+01
1716.lowfreq: -15.9850 -10.3436 -6.7777 -0.0007 -0.0005 0.0003 73.1467 102.4058 255.9448
frequency: 73.1402 102.3733 255.9448 409.7613 417.5459 581.1028 640.5521 881.7383 917.0405 939.3358 946.0759 953.1642 994.4866 1003.8859 1045.7535 1168.5987 1204.7006 1268.2814 1288.1077 1295.7992 1421.1400 1430.8557 1449.3669 1655.2814 1662.1465 2940.8741 3042.3086 3076.1031 3081.6652 3093.2372 3096.5831 3194.7941 3195.5808
redmass: 2.9415 1.8362 1.7567 2.0494 2.2634 1.3518 1.5614 1.4261 1.8607 1.3221 1.4280 1.6140 1.1012 1.1658 1.6040 2.3024 1.2900 1.3020 1.2516 1.2207 1.1626 1.1943 1.0992 4.6537 4.7979 1.0658 1.0923 1.0743 1.0675 1.0785 1.0868 1.1147 1.1143
irintensity: 0.2310 0.0729 0.6146 0.5601 1.6540 13.9868 21.4370 0.2987 26.7611 40.5787 110.4687 2.2163 4.4514 23.4805 15.0946 1.7199 2.9543 0.1599 0.0495 0.8063 7.7445 1.4297 17.4481 27.9459 7.4937 28.0496 7.4060 0.0790 50.4246 12.0905 10.1186 18.3753 43.2719
temp: 298.150 k
press: 1.00000 atm
elementType: 6 6 6 6 6 1 1 1 1 1 1 1 1
symmnumber: 1
zpe: 291454.1 jmol-1
zpe.correction: 0.111009 hartree
zpe.thermalcorrener: 0.117184 hartree
zpe.thermalcorrenthalpy: 0.118129 hartree
zpe.thermalcorrgfe: 0.081394 hartree
zpe.sumelectzpe: -194.882328 hartree
zpe.sumelectthermal: -194.876152 hartree
zpe.sumelectthermalent: -194.875208 hartree
zpe.sumelectthermalfe: -194.911942 hartree
dipole: 0.0000 -0.3239 0.1682
dipole: 0.3649
quadrupole: -31.7060 -29.5753 -32.7164
quadrupole: -0.0001 0.0000 2.2681
quadrupole: -0.3734 1.7573 -1.3838 -0.0001 0.0000 2.2681
hfenergy: -194.9933365 hartree
pointgroup: C01 [X(C5H8)]
dipole: 0.0000008 0.1433031 0.0088758 debye
dipolederiv: -0.1504963 -0.0000029 -0.0000077 -0.0000103 0.1285712 -0.0005525 -0.0000008 -0.0488651 0.0536419 0.223925 0.1634652 -0.1036026 0.1593727 -0.0498548 0.123158 -0.2881589 0.140428 0.0950318 0.2239112 -0.1634626 0.1036133 -0.1593602 -0.0498537 0.1231606 0.2881636 0.1404389 0.0950396 -0.2718141 0.0791247 -0.1331841 0.0455664 -0.2767497 0.1641348 -0.1186596 0.140613 -0.0047027 -0.2718201 -0.0791262 0.1331741 -0.0455722 -0.2767356 0.1641448 0.1186512 0.1406203 -0.0047073 0.0003915 -0.0000004 -0.0000035 -0.0000009 -0.1395868 0.0771219 -0.0000029 0.0678661 0.0844925 0.0157078 0.0000014 0.0000047 0.0000047 0.0296844 -0.135222 0.0000034 -0.0729453 -0.0919535 0.0652579 -0.0453919 0.0199795 -0.0311004 0.0682828 -0.1198754 0.0738964 -0.1073311 -0.0932984 0.0652594 0.045395 -0.0199732 0.0311033 0.0682744 -0.119881 -0.0738904 -0.1073376 -0.0932925 -0.0500016 -0.0681045 0.1143621 -0.0968879 0.1495293 -0.0270762 0.1304858 -0.0218173 0.0392821 0.0998345 -0.0189399 0.0604995 -0.0299309 0.0994595 -0.1110157 0.0234472 -0.1249219 -0.0594076 -0.0499933 0.0680991 -0.1143693 0.0968813 0.149529 -0.0270766 -0.1304938 -0.0218206 0.0392743 0.0998381 0.0189429 -0.0604927 0.0299343 0.09945 -0.1110208 -0.0234413 -0.1249273 -0.0594004 unknown
polarizability: 71.1815025|0.0001036|43.5194789|0.001018|7.58065|42.6761071 unknown
InChI: InChI=1S/C5H8/c1-3-5-4-2/h3-4H,1-2,5H2
charge 0 multiplicity 1
13 atoms
C  0.00002 0.563934 -0.475952
C  -1.262699 0.270034 0.319428
C  1.262713 0.270085 0.319491
C  -2.263029 -0.551877 -0.083023
C  2.263067 -0.551834 -0.082885
H  0.000007 1.641839 -0.751117
H  0.000055 -0.010914 -1.419963
H  -1.342676 0.776941 1.29404
H  1.342643 0.777036 1.294083
H  -3.151818 -0.721549 0.535263
H  -2.220245 -1.082763 -1.042284
H  3.151833 -0.721472 0.535444
H  2.220327 -1.08276 -1.042125
