program: Gaussian 09
title: 000137514
version: EM64L-G09RevD.01
frameworkgroup: C1[X(C13H9NO3)]
method: RPBEPBE
basis: SDD
operation: Freq
keyword: #p
keyword: freq=noraman
keyword: PBEPBE/SDD
title: #p freq=noraman PBEPBE/SDD
converged: YES YES NO NO
title: Mulliken charges:
elementType: O O O N C C C C C C C C C C C C C H H H H H H H H H
charge: -0.196080 -0.199809 -0.180748 0.014090 0.232604 0.339235 0.018667 0.224325 -0.335453 -0.367288 -0.349310 -0.348035 -0.227717 -0.205342 -0.229309 -0.226614 -0.226923 0.268655 0.287118 0.240941 0.274825 0.244390 0.245688 0.232368 0.235039 0.234684
chargesum: 0.00000
title: Mulliken charges with hydrogens summed into heavy atoms:
elementType: O O O N C C C C C C C C C C C C C
charge: -0.196080 -0.199809 -0.180748 0.014090 0.232604 0.339235 0.018667 0.224325 -0.066798 -0.080170 -0.108368 -0.073210 0.016673 0.040346 0.003059 0.008425 0.007761
polarizability: 2.09955680e+02 -9.67822575e+00 1.41053227e+02 1.93427872e+01 1.22550602e+01 1.21333783e+02
1716.lowfreq: -10.8622 -3.4490 -3.0306 -0.0005 -0.0004 -0.0001 20.4667 42.6767 60.4313
frequency: 20.3990 42.6462 60.4294 89.8326 113.5543 138.5131 172.8724 220.0450 251.2871 272.4117 333.0024 393.3260 400.3945 413.4742 431.1463 446.3476 524.3788 570.5456 612.6716 628.4795 652.8680 663.9039 685.0940 699.4719 711.5467 751.2498 783.3216 792.4398 799.3310 860.4979 887.9722 917.7713 946.5465 975.0536 989.1032 991.4080 1002.3620 1008.1934 1024.0802 1035.2453 1060.6267 1085.1564 1137.1526 1150.0871 1175.0242 1175.7360 1187.6569 1213.0926 1254.2204 1283.7764 1317.3700 1366.7682 1385.0985 1389.0886 1427.5747 1435.3310 1463.4295 1478.7426 1552.5951 1575.2900 1591.2888 1605.8082 1609.8685 3128.5037 3136.3596 3144.8206 3148.2258 3159.0828 3159.8773 3170.7560 3171.0830 3184.8253
redmass: 8.3640 4.2254 5.8464 7.5319 6.7520 6.9240 5.9684 5.5557 5.8807 6.4794 8.5402 8.4264 2.8792 3.7347 5.2033 4.5429 6.0518 4.6824 6.4606 6.1397 7.1528 5.5562 4.6694 1.6526 6.0316 3.7296 1.7213 2.8971 3.1868 1.2488 1.5410 4.4488 1.4311 1.3905 5.5777 1.4229 1.3468 1.3417 2.2274 2.5942 3.5548 1.5724 2.0665 2.3756 1.0620 1.0904 1.1525 9.6734 2.0209 2.2450 1.3571 11.5647 5.9888 8.9568 2.4834 2.2668 2.4973 2.2786 10.0361 6.3540 6.4842 6.9263 6.1918 1.0854 1.0883 1.0868 1.0922 1.0912 1.0962 1.1003 1.0969 1.0984
irintensity: 2.8655 0.7959 1.7335 0.5750 0.0838 0.9494 5.1126 3.4485 0.5269 2.3668 8.9595 2.4952 0.1685 0.5097 2.1370 3.6582 4.5458 2.0647 0.3263 28.1362 13.8542 13.8241 13.9268 87.1413 4.0829 28.2018 47.3463 35.7421 4.8296 1.2993 5.2441 46.9928 1.2841 2.1585 2.9041 0.5409 1.2567 0.2948 2.4021 1.5972 3.4767 11.8795 3.2496 11.9418 2.2725 5.2238 14.1930 184.7540 99.9991 157.9318 13.3050 163.5626 1.0798 2.6004 7.3761 24.8936 3.6335 1.0221 161.3638 10.0575 12.7335 8.1443 8.2316 1.6846 3.6773 2.0016 18.8553 5.9026 15.6234 27.0552 3.6108 9.1780
temp: 298.150 k
press: 1.00000 atm
elementType: 8 8 8 7 6 6 6 6 6 6 6 6 6 6 6 6 6 1 1 1 1 1 1 1 1 1
symmnumber: 1
zpe: 494282.2 jmol-1
zpe.correction: 0.188262 hartree
zpe.thermalcorrener: 0.202066 hartree
zpe.thermalcorrenthalpy: 0.203010 hartree
zpe.thermalcorrgfe: 0.145803 hartree
zpe.sumelectzpe: -779.942992 hartree
zpe.sumelectthermal: -779.929189 hartree
zpe.sumelectthermalent: -779.928244 hartree
zpe.sumelectthermalfe: -779.985451 hartree
dipole: 1.3136 -1.9555 4.5225
dipole: 5.0993
quadrupole: -71.9724 -105.7637 -99.6557
quadrupole: -5.7837 3.1218 -0.7673
quadrupole: 20.4916 -13.2998 -7.1918 -5.7837 3.1218 -0.7673
hfenergy: -780.1312543 hartree
pointgroup: C01 [X(C13H9N1O3)]
dipole: 0.3708469 1.6401902 -1.0941401 debye
dipolederiv: -0.801087 0.0132371 0.0090051 0.0516531 -0.2999682 -0.065886 -0.2571388 -0.0766338 -0.9338271 -0.406375 0.031747 0.1495146 0.0904085 -0.6723581 -0.2430835 0.2894219 -0.2665652 -0.4738672 -0.655543 -0.0975747 0.2133786 -0.0782286 -0.538741 0.0222041 0.2762593 -0.0490902 -0.4105059 0.8104528 0.2986817 -0.3717023 0.2801688 1.3276072 0.2954416 -0.5098607 0.3392407 0.678695 -0.2285927 -0.0949785 0.0502556 0.0731945 0.1152694 0.0013026 0.124713 0.1511562 -0.0692673 -0.6668634 -0.0553601 -0.2553831 -0.1216566 -0.0139724 -0.0652558 -0.2716381 -0.0165978 -0.2389823 1.8283235 0.0395956 0.1688968 -0.0455495 0.2750935 0.1227205 0.4387757 0.0469422 1.0239428 0.0157288 -0.2426845 -0.0140221 -0.2018017 -0.4487179 -0.1104619 -0.151889 -0.0777037 0.0346016 -0.2303625 -0.1287893 -0.0325616 -0.1155764 -0.0353029 0.0955912 0.0326844 0.1520121 -0.0433218 -0.1195509 0.1521133 0.0391704 -0.0589051 0.0717292 0.090025 -0.0567589 -0.0592949 -0.0713118 0.0431188 0.0509219 -0.04574 0.0621148 -0.0943578 -0.0028342 0.2071403 0.0153767 0.0240888 0.0576987 0.0073098 0.1436776 0.0355788 -0.0868206 -0.0247414 -0.1450314 -0.0509574 0.067524 0.0832963 0.0942685 -0.0417612 0.0517273 0.1469442 0.0751013 -0.0908003 0.0531384 -0.0481328 0.0933216 0.0465159 -0.1234235 0.1313317 -0.1977733 -0.0688854 -0.0902403 -0.0625793 -0.1022381 -0.2756355 -0.0081515 -0.0161923 -0.0362529 -0.1382601 -0.0497116 0.0385392 -0.0531888 0.1459528 0.0773321 0.0769259 -0.1500397 0.0831351 -0.1208344 -0.0360496 -0.1667738 -0.0279697 -0.1431508 0.0999531 0.0478972 0.071334 0.0473746 -0.1166093 -0.0175264 0.0470773 -0.0149805 0.0625035 0.0810556 0.044443 0.0645161 0.0365414 0.0464578 -0.0397517 0.0395563 -0.0766633 0.0878984 0.1230307 0.0145046 0.0232786 0.0334172 0.073153 -0.0535746 0.0632093 -0.0233877 0.1268597 -0.0225583 -0.0531796 0.0750841 -0.0677385 0.1028405 0.0119866 0.1013282 0.0175026 0.0598837 0.1365693 -0.0056543 -0.029186 0.0022579 0.1376292 0.0242673 0.0230982 0.0349993 -0.0030785 0.0641116 -0.0769584 0.009105 -0.0980708 -0.0412701 -0.0377643 0.0208145 -0.0371395 0.1311982 -0.0412244 -0.0497008 0.0847747 -0.0430071 0.0844986 -0.0053688 0.0981767 0.0014503 0.1074259 0.0794946 -0.0166214 0.0081819 -0.0168639 0.14016 0.0462953 -0.0306194 0.0464928 -0.102104 -0.0823498 -0.0598267 0.0646403 -0.0662145 0.1353142 0.0360746 0.0732825 0.0344886 0.0525343 -0.0633448 -0.0286815 -0.0948016 -0.0290381 0.1482893 -0.0001151 -0.103326 -0.0000485 0.0366791 unknown
polarizability: 206.0137788|25.6189938|128.0984561|-12.795637|12.9732546|138.2304556 unknown
InChI: InChI=1S/C13H9NO3/c15-13(10-6-2-1-3-7-10)11-8-4-5-9-12(11)14(16)17/h1-9H
charge 0 multiplicity 1
26 atoms
O  -0.409894 0.49486 2.479098
O  1.637889 -2.458354 -1.318007
O  0.196231 -2.068167 0.405965
N  1.139653 -1.703032 -0.397898
C  1.00495 0.623518 0.548537
C  -1.570257 0.264481 0.368196
C  -0.348546 0.413287 1.217849
C  1.69474 -0.335429 -0.236197
C  1.637093 1.876314 0.744563
C  2.945969 -0.068545 -0.834248
C  -1.552649 0.515027 -1.029601
C  -2.788682 -0.108501 0.997295
C  2.887967 2.163472 0.155659
C  3.540998 1.193245 -0.641518
C  -2.736613 0.390971 -1.787223
C  -3.966995 -0.238507 0.238275
C  -3.943872 0.010346 -1.156496
H  1.134929 2.622738 1.367967
H  3.429907 -0.853394 -1.421713
H  -0.623292 0.82136 -1.523245
H  -2.78134 -0.295313 2.076061
H  3.353185 3.140666 0.321672
H  4.512783 1.412377 -1.094739
H  -2.719756 0.588909 -2.864347
H  -4.901834 -0.536253 0.725175
H  -4.86136 -0.091778 -1.746779
