program: Gaussian 09
title: 000137505
version: EM64L-G09RevD.01
frameworkgroup: C1[X(C11H11N)]
method: RPBEPBE
basis: SDD
operation: Freq
keyword: #pfreq=noraman
keyword: PBEPBE/SDD
title: #p freq=noraman PBEPBE/SDD
converged: YES YES NO YES
title: Mulliken charges:
elementType: N C C C C C C C C C C C H H H H H H H H H H H
charge: -0.423727 0.425221 0.385181 0.478138 -0.638804 -0.432702 -0.386069 -0.428457 -0.415664 -0.242641 -0.257408 -0.635614 0.220813 0.230050 0.235535 0.231048 0.234917 0.221421 0.223267 0.295892 0.229357 0.229375 0.220871
chargesum: 0.00000
title: Mulliken charges with hydrogens summed into heavy atoms:
elementType: N C C C C C C C C C C C
charge: -0.127835 0.425221 0.385181 0.478138 -0.417991 -0.202652 -0.150535 -0.197409 -0.180746 -0.021220 -0.034140 0.043988
polarizability: 2.20275599e+02 -2.62658745e+00 1.26223600e+02 1.81896580e-03 -2.35497921e-03 5.47645301e+01
1716.lowfreq: -11.0483 -5.2269 -0.0009 -0.0006 -0.0003 12.4113 72.3713 127.6837 168.3444
frequency: 72.3636 127.6795 168.3379 186.2653 189.9345 291.4510 327.2062 369.2614 389.3147 406.2644 470.7814 511.5450 539.3088 552.1170 615.6919 654.2455 711.3725 752.3048 758.0363 776.9503 815.3490 845.4217 876.7579 889.9532 936.2561 946.2082 966.0851 981.8901 1020.7221 1067.8558 1122.6207 1124.3518 1151.2492 1169.6127 1176.0862 1212.4698 1244.5092 1276.1642 1330.4180 1345.7748 1398.0543 1417.1175 1437.3324 1447.6993 1466.4609 1467.0274 1494.4287 1511.1225 1528.7563 1579.0932 1613.1288 1646.4892 2942.1527 3003.9039 3090.7490 3105.5388 3113.3369 3118.0656 3121.0159 3137.2278 3157.9544 3159.4517 3591.2582
redmass: 3.3262 2.3841 1.4731 3.2999 2.5622 3.3562 3.9395 1.2187 4.8364 3.0218 2.4202 6.7045 3.3885 4.1200 6.4832 2.5252 4.7324 1.3565 4.9471 2.2215 1.3794 1.5613 4.8797 1.9103 4.2049 1.3510 1.4056 1.3367 2.2830 2.0404 1.6889 1.2738 1.5589 1.0906 1.3391 1.6442 1.6536 1.7082 2.0174 2.2232 2.2327 4.3531 3.4855 1.3647 1.8964 1.0415 1.4748 1.5727 3.0808 6.1829 5.6451 6.6123 1.0378 1.1012 1.0954 1.0906 1.0854 1.0890 1.0880 1.0945 1.0993 1.0953 1.0773
irintensity: 5.3737 1.0826 0.8493 1.0248 0.4096 1.5531 1.4675 104.4618 0.3325 6.7681 25.3404 0.0363 1.2956 4.2128 5.0635 0.0246 4.7881 41.1439 0.0699 0.8820 33.1915 77.6727 0.5984 15.2824 1.2487 2.7055 5.7191 0.0410 8.5216 8.9518 8.2145 1.7362 3.1743 0.3533 18.9078 15.9975 14.4360 4.6598 68.7706 45.0203 8.5088 8.1935 22.7372 2.4863 0.8027 12.0411 3.7475 183.2531 40.9731 4.8317 61.7598 273.9911 129.8269 55.8825 28.3211 22.2893 9.7271 1.5168 7.7983 41.4414 54.3186 8.2728 40.4320
temp: 298.150 k
press: 1.00000 atm
elementType: 7 6 6 6 6 6 6 6 6 6 6 6 1 1 1 1 1 1 1 1 1 1 1
symmnumber: 1
zpe: 495957.1 jmol-1
zpe.correction: 0.188900 hartree
zpe.thermalcorrener: 0.198985 hartree
zpe.thermalcorrenthalpy: 0.199929 hartree
zpe.thermalcorrgfe: 0.153619 hartree
zpe.sumelectzpe: -479.686278 hartree
zpe.sumelectthermal: -479.676193 hartree
zpe.sumelectthermalent: -479.675249 hartree
zpe.sumelectthermalfe: -479.721559 hartree
dipole: -2.8957 -0.5744 -0.0005
dipole: 2.9521
quadrupole: -54.5711 -60.9949 -77.8829
quadrupole: 2.6009 0.0011 0.0034
quadrupole: 9.9119 3.4881 -13.3999 2.6009 0.0011 0.0034
hfenergy: -479.8751781 hartree
pointgroup: C01 [X(C11H11N1)]
dipole: -1.1383713 -0.2294062 -0.0214128 debye
dipolederiv: -1.812072 -0.0446601 -0.031669 -0.5510614 -0.2483605 -0.0221783 -0.0150232 -0.0094788 -0.5087762 0.5686352 0.1424896 0.0081527 0.1676181 -0.0605418 0.0083779 0.0074626 0.0077013 0.0657423 -0.3083079 0.0802725 -0.0107672 -0.1437894 -0.2203523 0.0039597 -0.0034622 0.0096054 0.0109283 1.7446153 0.3230145 0.0302318 0.7118777 0.0683906 0.0204812 0.0179963 0.0107402 0.1464416 -0.7869243 -0.1538344 -0.0077828 0.2549249 0.0926064 -0.0056877 -0.0210415 -0.0160044 -0.282603 0.3292387 -0.1408398 0.0167969 -0.0123303 0.1567084 -0.0105058 0.0126839 -0.0137046 -0.1550763 -0.3361083 0.0177637 -0.0034453 -0.4804041 0.012278 -0.0199366 0.0124887 -0.0073122 -0.2264259 -0.1942524 -0.090966 0.0031455 0.0246767 0.1262177 -0.0101517 -0.0006648 -0.0129977 -0.2007112 0.2867456 -0.0867173 0.0143001 0.0837026 0.1253743 -0.0075884 0.0085995 -0.0118813 -0.1673447 0.0236961 -0.012155 0.0050824 -0.089273 0.1788474 -0.0134612 0.007601 -0.011554 -0.1601563 -0.1561031 0.1417792 -0.0035756 0.1542911 -0.1465702 0.0021609 -0.0038329 0.0018885 -0.1986589 0.6661595 -0.1553989 0.0143754 -0.4642046 0.2920402 -0.0115843 0.0242596 -0.0037278 0.3035102 0.0349096 -0.0325627 -0.0023783 -0.0759127 -0.1240517 0.0076222 -0.0010683 0.0086638 0.1696457 0.0686806 -0.0587963 -0.0000963 -0.004833 -0.1157464 0.0085371 -0.0018255 0.0071434 0.1493447 -0.0564762 0.1075332 -0.0089886 0.1008476 0.0242652 0.007045 -0.0088266 0.0071874 0.1626043 0.0661068 -0.0679419 -0.0000812 0.0090603 -0.1238302 0.0094909 -0.002644 0.0075116 0.1570648 0.0708724 0.0082145 -0.0023844 -0.0723921 -0.1241132 0.0073978 0.0002998 0.0094257 0.1548904 -0.0774354 0.1182167 -0.0098814 0.1266028 -0.0027759 0.0085537 -0.0101342 0.0083368 0.1587075 -0.1332767 -0.0775042 -0.0050544 -0.0789742 0.0549097 0.001735 -0.0050977 0.0017701 0.1676334 0.0907559 0.0592742 -0.0079117 0.1107716 0.0969502 0.0102064 -0.0097268 0.0088606 0.3281908 0.015606 -0.0021288 0.0212799 0.1959676 -0.0217582 0.1243302 -0.0917543 0.1181442 -0.1097924 0.0125312 0.0025442 -0.0158495 0.2074777 -0.0374789 -0.1187136 0.0840888 -0.1226588 -0.0904094 -0.1175965 -0.0775971 -0.0034988 -0.174644 -0.0030086 -0.0000904 -0.000378 0.0023405 0.1252506 unknown
polarizability: 220.1816814|-2.2723671|126.1315297|4.2532611|-2.3964275|54.9505182 unknown
InChI: InChI=1S/C11H11N/c1-12-11-7-6-9-4-2-3-5-10(9)8-11/h2-8,12H,1H3
charge 0 multiplicity 1
23 atoms
N  -3.103482 -0.796973 -0.098967
C  0.644829 -0.654448 -0.008428
C  0.870735 0.779141 -0.049841
C  -1.802757 -0.288618 -0.082267
C  -0.690074 -1.156333 -0.025849
C  -0.271984 1.641298 -0.106665
C  -1.570087 1.13504 -0.122594
C  1.789058 -1.524034 0.04923
C  2.212224 1.281904 -0.032664
C  3.084992 -1.004215 0.064845
C  3.30396 0.411385 0.023509
C  -4.309246 0.024772 -0.155685
H  -0.847968 -2.242947 0.005373
H  -0.113867 2.726495 -0.138085
H  -2.420528 1.822543 -0.166134
H  1.629232 -2.608926 0.08091
H  2.370105 2.367227 -0.064537
H  3.946008 -1.681181 0.108971
H  4.326707 0.803607 0.036445
H  -3.212003 -1.808635 -0.069439
H  -4.350125 0.644913 -1.074649
H  -4.394184 0.703366 0.717784
H  -5.193845 -0.633581 -0.155962
