program: Gaussian 09
title: 000137484
version: EM64L-G09RevD.01
frameworkgroup: C1[X(C10H15NO2)]
method: RPBEPBE
basis: SDD
operation: Freq
keyword: #p
keyword: freq=noraman
keyword: PBEPBE/SDD
title: #p freq=noraman PBEPBE/SDD
converged: YES YES NO NO
title: Mulliken charges:
elementType: O O N C C C C C C C C C C H H H H H H H H H H H H H H H
charge: -0.289156 -0.285018 -0.447956 0.182706 -0.058917 0.190543 0.286760 -0.779558 -0.795264 -0.758781 0.155204 -0.215448 -0.677857 0.301433 0.196914 0.236891 0.236711 0.230755 0.243570 0.231189 0.256859 0.192354 0.260481 0.222807 0.223008 0.208555 0.225625 0.225589
chargesum: 0.00000
title: Mulliken charges with hydrogens summed into heavy atoms:
elementType: O O N C C C C C C C C C C
charge: -0.289156 -0.285018 -0.146524 0.182706 -0.058917 0.190543 0.286760 -0.109041 -0.089750 -0.049087 0.155204 0.230366 -0.018087
polarizability: 1.66605623e+02 -8.35207480e-01 1.36087984e+02 -1.67910415e-02 7.75395504e-02 7.40918328e+01
1716.lowfreq: -9.3673 -0.0007 -0.0006 -0.0002 4.0730 7.1417 41.6315 59.1022 76.3648
frequency: 41.4320 58.7765 76.3349 83.6731 91.2440 94.4624 133.8379 137.6489 173.0103 219.6566 246.2736 250.3936 283.2187 292.5998 324.0026 330.7470 380.0176 400.3361 542.3086 574.7510 601.1067 633.2752 637.6003 643.0572 744.3419 765.0670 800.1895 836.9044 842.4073 958.3460 991.5782 1017.8173 1031.6647 1042.0420 1046.1620 1048.5765 1048.7785 1111.3720 1135.9047 1140.2371 1236.5699 1246.8287 1257.8479 1330.0325 1360.6382 1394.9589 1400.1763 1409.1489 1412.5857 1425.4211 1443.6788 1449.5945 1457.9410 1464.1186 1468.3605 1471.0520 1475.0363 1476.2589 1486.1314 1488.8303 1536.3017 1599.1452 1619.4755 2961.1127 2983.1632 2986.0842 2992.4177 3004.0893 3026.7862 3060.0514 3066.9037 3072.2249 3080.7022 3082.6321 3088.3075 3094.9417 3102.9813 3585.6534
redmass: 2.9584 1.1743 1.8887 2.5290 1.2584 3.4794 1.3190 1.6664 2.8489 3.8496 1.3307 2.9230 3.5933 2.6001 4.2291 3.7963 4.2286 4.6603 3.2708 4.2054 1.3198 3.1999 4.4025 5.1747 7.6013 6.2516 1.1054 3.2002 3.6366 1.6048 1.5690 2.4296 1.3932 1.4519 5.0101 1.9801 1.5531 2.2136 1.4645 3.6557 2.1965 1.1354 3.0477 2.4663 1.7646 1.3169 1.2771 1.2955 1.2521 3.3801 1.0464 2.2344 1.0448 1.0407 1.0667 1.0444 1.0886 1.1758 1.3344 1.1674 5.2409 9.5869 5.5291 1.0396 1.0369 1.0361 1.0358 1.0581 1.0984 1.1064 1.0973 1.0975 1.0991 1.0993 1.0984 1.0936 1.1022 1.0803
irintensity: 2.0169 0.0161 3.2496 0.0593 0.0841 1.4163 3.4269 2.2080 3.1571 3.1496 0.8031 0.7181 0.0081 0.4380 14.6435 1.6548 3.5735 1.3309 2.9005 0.5869 63.5452 29.7099 0.0070 1.8826 5.5132 6.9116 2.8838 1.8349 2.6320 0.2297 12.2492 20.7815 0.1559 12.0670 347.0695 95.8979 11.8541 2.3501 4.8684 19.1962 76.9437 0.0255 90.9099 22.7196 0.8506 21.7542 19.9914 27.3456 6.2775 22.9657 13.8185 91.6638 5.3046 13.6809 13.0147 15.8111 1.1821 25.9862 2.7827 14.4090 57.2228 257.6472 84.6799 71.6987 43.9055 27.2966 26.5444 27.1500 27.1525 9.6122 19.0223 12.2390 17.0271 47.3664 31.6924 14.2739 49.1017 43.9201
temp: 298.150 k
press: 1.00000 atm
elementType: 8 8 7 6 6 6 6 6 6 6 6 6 6 1 1 1 1 1 1 1 1 1 1 1 1 1 1 1
symmnumber: 1
zpe: 609553.2 jmol-1
zpe.correction: 0.232167 hartree
zpe.thermalcorrener: 0.247295 hartree
zpe.thermalcorrenthalpy: 0.248239 hartree
zpe.thermalcorrgfe: 0.189399 hartree
zpe.sumelectzpe: -594.287335 hartree
zpe.sumelectthermal: -594.272207 hartree
zpe.sumelectthermalent: -594.271263 hartree
zpe.sumelectthermalfe: -594.330102 hartree
dipole: 2.7995 -1.2037 0.0047
dipole: 3.0473
quadrupole: -57.5365 -78.8055 -79.4603
quadrupole: 6.2731 0.0168 0.0055
quadrupole: 14.3976 -6.8714 -7.5262 6.2731 0.0168 0.0055
hfenergy: -594.5195014 hartree
pointgroup: C01 [X(C10H15N1O2)]
dipole: 1.1114529 0.4487822 0.0249641 debye
polarizability: 166.5983728|0.1321321|136.0471527|1.6474522|1.0828081|74.139915 unknown
InChI: InChI=1S/C10H15NO2/c1-5-13-10(12)9-6(2)7(3)11-8(9)4/h11H,5H2,1-4H3
charge 0 multiplicity 1
28 atoms
O  -1.990455 0.346188 -0.102723
O  -1.531416 -1.941684 -0.131696
N  2.529861 -0.573296 -0.035808
C  0.892256 0.989925 -0.041928
C  0.299437 -0.345398 -0.07293
C  2.280585 0.815966 -0.01994
C  1.349834 -1.296013 -0.068719
C  0.168252 2.312455 -0.034137
C  3.416484 1.799443 0.017133
C  1.329274 -2.796833 -0.094461
C  -1.103949 -0.751113 -0.104695
C  -3.43722 -0.006922 -0.134462
C  -4.212173 1.308114 -0.122813
H  3.458871 -0.99283 -0.029264
H  0.878869 3.157529 -0.012312
H  -0.475671 2.42188 -0.924783
H  -0.501433 2.398031 0.840033
H  4.083827 1.702588 -0.861979
H  3.028137 2.830838 0.019937
H  4.040863 1.682409 0.925075
H  0.835649 -3.171926 -1.008468
H  2.353016 -3.212507 -0.046748
H  0.740996 -3.198664 0.748631
H  -3.635923 -0.604812 -1.042994
H  -3.66685 -0.639771 0.742457
H  -5.298635 1.104454 -0.146691
H  -3.98767 1.889837 0.787946
H  -3.954916 1.924512 -1.00156
