program: Gaussian 09
title: 000137482
version: EM64L-G09RevD.01
frameworkgroup: C1[X(C9H13NO2)]
method: RPBEPBE
basis: SDD
operation: Freq
keyword: #p
keyword: freq=noraman
keyword: PBEPBE/SDD
title: #p freq=noraman PBEPBE/SDD
converged: NO YES NO NO
title: Mulliken charges:
elementType: O O N C C C C C C C C C H H H H H H H H H H H H H
charge: -0.285254 -0.280291 -0.454913 0.273217 0.068635 0.357159 -0.472348 -0.758584 0.143022 -0.807522 -0.215321 -0.677057 0.302704 0.274836 0.194810 0.258962 0.258916 0.251376 0.229800 0.229663 0.222784 0.222832 0.206921 0.227831 0.227824
chargesum: 0.00000
title: Mulliken charges with hydrogens summed into heavy atoms:
elementType: O O N C C C C C C C C C
charge: -0.285254 -0.280291 -0.152210 0.273217 0.068635 0.357159 -0.197512 -0.045896 0.143022 -0.096684 0.230295 -0.014481
polarizability: 1.54505860e+02 3.40041693e+00 1.22452492e+02 -2.31589119e-02 9.52890931e-03 6.57615643e+01
1716.lowfreq: -67.4418 -8.5197 -5.8584 -0.7804 -0.0007 -0.0004 0.0003 47.0371 79.6389
frequency: -67.3883 46.4194 79.6048 87.9790 88.3532 105.7952 163.6014 208.0549 213.1348 240.1346 251.5803 313.1099 317.8554 372.0753 399.1504 507.6942 597.4192 606.7733 620.3420 635.8904 719.0616 740.2502 791.5602 799.9846 839.0734 840.7788 958.9305 988.5731 1001.1411 1018.8261 1034.7939 1046.8185 1047.3242 1111.6642 1135.8219 1144.5186 1208.0762 1247.1146 1252.4264 1329.0789 1356.3516 1375.5848 1400.5725 1406.6474 1412.9430 1442.3154 1445.1009 1463.3408 1469.2280 1474.5982 1475.3737 1485.0507 1488.0902 1538.7654 1605.0586 1616.3732 2965.3075 2985.8149 2993.8828 3004.6738 3033.5503 3061.1733 3073.5179 3082.7254 3089.8317 3096.8822 3104.9807 3235.9944 3582.9138
redmass: 1.0211 2.6893 3.1048 3.5793 2.5709 1.1995 2.7145 3.8846 2.8560 2.7800 1.3516 4.0421 4.1281 3.6418 5.0455 3.5453 4.3763 1.5340 3.4518 2.7871 5.1819 5.5866 4.7817 1.1023 3.6396 1.3637 1.6295 3.6663 1.4348 2.5878 1.4458 1.4557 5.7614 2.1954 1.4632 1.4889 5.2536 1.1360 1.6154 2.7097 1.8651 3.2265 1.2763 1.2939 1.2607 2.3482 1.0435 1.0405 1.0438 1.0639 1.1409 1.3284 1.1015 6.8508 4.7762 11.0428 1.0392 1.0367 1.0360 1.0579 1.0984 1.1065 1.0972 1.0999 1.0984 1.0952 1.1022 1.0988 1.0804
irintensity: 0.1111 1.6659 5.4178 1.8626 2.1242 1.2641 0.2383 4.0097 1.4300 0.3404 0.9899 0.3879 10.9522 4.5772 0.8860 0.3710 0.2267 43.7251 6.6746 32.5958 5.6797 20.2244 12.1165 2.1898 0.7980 35.3543 0.9680 32.1525 11.4558 22.4594 2.5204 9.6830 387.1687 1.7953 5.1063 42.2642 223.3027 0.0345 5.9293 19.7686 9.3360 51.3601 20.4741 1.2631 6.9073 86.9566 13.5676 11.5091 15.1038 10.4110 14.3689 0.3667 12.1696 62.4500 44.9197 290.7025 65.3562 31.7965 25.0571 26.8035 27.0624 12.0784 9.1096 24.8538 35.5671 12.9853 48.6641 2.3303 43.1190
temp: 298.150 k
press: 1.00000 atm
elementType: 8 8 7 6 6 6 6 6 6 6 6 6 1 1 1 1 1 1 1 1 1 1 1 1 1
symmnumber: 1
zpe: 537586.4 jmol-1
zpe.correction: 0.204756 hartree
zpe.thermalcorrener: 0.217371 hartree
zpe.thermalcorrenthalpy: 0.218316 hartree
zpe.thermalcorrgfe: 0.165209 hartree
zpe.sumelectzpe: -555.060208 hartree
zpe.sumelectthermal: -555.047593 hartree
zpe.sumelectthermalent: -555.046648 hartree
zpe.sumelectthermalfe: -555.099755 hartree
dipole: -3.1263 -1.1735 0.0031
dipole: 3.3392
quadrupole: -50.0189 -71.7379 -73.3387
quadrupole: -5.2601 -0.0066 0.0028
quadrupole: 15.0130 -6.7061 -8.3069 -5.2601 -0.0066 0.0028
hfenergy: -555.264964 hartree
pointgroup: C01 [X(C9H13N1O2)]
dipole: 1.2363505 -0.4442991 -0.0014802 debye
dipolederiv: -1.6240438 -0.4401622 -0.000372 -0.7665211 -0.7660891 0.0000616 -0.0017855 -0.0008305 -0.2852579 -0.8637759 0.2052396 0.000429 0.1831035 -0.9847356 -0.0009661 -0.0002739 0.0009146 -0.3251184 -0.7779008 -0.000949 0.0002517 0.202118 -0.2772067 -0.0000273 0.0005115 -0.0000233 -0.230554 0.7691996 0.0087476 -0.0004879 0.1958985 0.1791557 -0.0001948 -0.0002703 -0.0000847 -0.0076352 -1.0885057 0.0211223 0.0004023 0.0154116 -0.1272787 -0.0000277 0.0011965 -0.0000473 -0.0827731 0.0806544 -0.0028161 -0.0002981 -0.0525566 0.2313796 -0.0001293 -0.0008684 0.0004186 -0.084297 0.0420164 0.0158616 -0.0002111 -0.188515 -0.059784 0.0001315 0.0000199 -0.0000738 -0.2265806 0.1314029 0.08289 -0.0001059 -0.0041895 -0.1212648 0.0000423 -0.000044 0.0000108 0.0379164 2.3028813 0.0679295 -0.0006064 0.3979798 1.3684192 0.0008998 -0.0000505 -0.0001211 0.2282758 0.0341328 0.0400237 0.0000642 -0.0407126 0.0027948 0.0002947 0.0006006 -0.0002611 0.1336169 1.0168522 0.1783319 0.0003084 0.0459129 0.2577888 -0.0000059 0.0006099 0.000203 0.3598068 -0.0532942 -0.0997452 -0.000065 -0.0759613 -0.0460748 -0.0001817 -0.0001259 -0.0001792 0.0637736 0.1803533 -0.0226845 0.0001196 -0.0092229 0.1863516 0.0000722 0.0000066 0.0000842 0.3074226 0.1147394 -0.0549092 0.0000882 -0.0455689 -0.0035026 0.0000896 0.0000855 0.0001105 0.1842642 -0.1755904 -0.1389821 0.0002971 -0.0257477 0.0364662 0.000036 0.0002574 0.0001228 0.1144032 0.0642488 0.0312032 -0.0825525 -0.0000065 0.0112926 0.0374075 -0.0593358 0.0834009 -0.0151679 0.0645137 0.0310712 0.0823936 -0.0000639 0.0111563 -0.0374337 0.0591316 -0.0835427 -0.0154485 0.050995 -0.1222592 0.0004371 -0.0222791 -0.0771951 0.000462 0.0001662 0.0006451 0.1217361 -0.0686928 0.0817519 0.1062295 0.0344118 0.0528795 0.042103 0.1610304 -0.0247374 -0.0583249 -0.0697812 0.0811936 -0.1065239 0.0332682 0.0529873 -0.0428281 -0.1610628 0.0238619 -0.0569205 -0.0768606 -0.0337562 0.0077895 0.0559911 -0.0018342 -0.0968951 0.0545335 -0.0942451 -0.0694341 -0.0766598 -0.0339589 -0.0076835 0.0558248 -0.0020194 0.096976 -0.0544029 0.0941936 -0.0692555 -0.2020706 0.0094637 -0.0002421 0.0347968 0.0673608 0.0000326 -0.0002956 -0.0000132 0.1121724 0.1125127 0.0477748 0.0597464 -0.0115998 0.0046011 -0.0944713 0.0316777 -0.1127585 -0.0683354 0.1126735 0.0476177 -0.059408 -0.011772 0.0043515 0.0945524 -0.0313118 0.112952 -0.0682852 unknown
polarizability: 154.5953504|-2.9472177|122.3629958|-0.0348876|0.0037923|65.7615702 unknown
InChI: InChI=1S/C9H13NO2/c1-4-12-9(11)8-5-6(2)10-7(8)3/h5,10H,4H2,1-3H3
charge 0 multiplicity 1
25 atoms
O  -1.961073 -0.484598 0.001862
O  -1.497951 1.808332 0.001556
N  2.556237 0.286207 -0.000446
C  1.414293 1.077866 0.000414
C  0.315823 0.187184 0.001841
C  2.22891 -1.087087 0.000225
C  0.837463 -1.163663 0.001461
C  1.470734 2.578051 0.000002
C  -1.079875 0.615619 0.00332
C  3.288067 -2.152231 -0.000756
C  -3.4111 -0.142031 0.000607
C  -4.173687 -1.463803 -0.0009
H  3.506616 0.655628 -0.001349
H  0.237865 -2.070874 0.002258
H  2.5143 2.942727 -0.001122
H  0.949223 2.992792 -0.880425
H  0.950962 2.993201 0.881263
H  2.813536 -3.14686 0.002382
H  3.937461 -2.098418 -0.896522
H  3.942399 -2.095132 0.891196
H  -3.630236 0.47077 0.894268
H  -3.628494 0.471789 -0.892781
H  -5.26228 -1.271005 -0.001852
H  -3.92522 -2.059868 -0.895811
H  -3.92697 -2.060896 0.89381
