program: Gaussian 09
title: 000137476
version: EM64L-G09RevD.01
frameworkgroup: C1[X(C10H22O)]
method: RPBEPBE
basis: SDD
operation: Freq
keyword: #pfreq=noraman
keyword: PBEPBE/SDD
title: #p freq=noraman PBEPBE/SDD
converged: YES YES NO NO
title: Mulliken charges:
elementType: O C C C C C C C C C C H H H H H H H H H H H H H H H H H H H H H H
charge: -0.474563 0.378533 -0.421996 -0.467242 -0.462026 -0.390826 -0.377991 -0.386527 -0.704977 -0.696647 -0.693311 0.195976 0.202608 0.224538 0.191782 0.184403 0.215347 0.241752 0.197850 0.212529 0.179644 0.208138 0.212561 0.318748 0.215146 0.212776 0.203506 0.217233 0.213934 0.210269 0.217033 0.213270 0.208531
chargesum: 0.00000
title: Mulliken charges with hydrogens summed into heavy atoms:
elementType: O C C C C C C C C C C
charge: -0.155815 0.378533 -0.023413 -0.050922 -0.062275 0.048776 0.014181 0.034171 -0.073549 -0.055210 -0.054477
polarizability: 1.24243104e+02 -6.60065941e-01 1.14790248e+02 -7.81123480e-01 7.92835920e-01 9.91557810e+01
1716.lowfreq: -23.0924 -0.0007 -0.0007 -0.0004 4.7537 20.4781 64.5839 68.7219 74.9201
frequency: 64.0796 68.6529 74.6360 76.7795 98.3898 104.8972 149.2078 192.7843 209.5277 231.5037 236.2569 240.8402 255.8178 291.7003 309.7980 324.4022 342.0426 349.6913 444.6009 510.8939 582.3940 734.6887 739.7151 743.3943 758.8885 836.1645 844.5775 871.0184 901.4234 905.2462 910.9740 954.6560 997.9340 1023.0181 1051.6766 1054.1230 1062.7999 1080.9648 1097.5043 1110.0607 1132.8581 1159.4481 1189.6450 1229.5474 1238.7375 1246.9201 1265.1964 1288.0877 1292.3623 1302.8540 1306.0628 1309.6780 1329.5771 1352.9506 1359.9159 1371.8362 1387.1664 1390.5215 1391.2836 1446.9638 1457.4431 1467.0335 1470.9664 1476.1098 1476.3081 1476.5942 1476.9756 1478.7702 1485.0816 1486.8951 1488.8896 2952.0918 2958.0081 2967.6683 2971.3134 2971.7292 2973.5034 2976.7657 2982.6190 2986.4258 3007.2314 3011.1160 3025.9782 3037.0219 3042.6246 3046.8702 3068.9472 3069.9150 3070.7473 3071.9536 3074.5137 3074.9364 3549.7080
redmass: 3.0644 1.7201 1.7387 2.7905 2.0401 1.9923 2.5949 2.9481 1.7108 1.1614 1.1954 1.2614 1.1477 3.0863 2.8899 2.9191 2.4454 3.0134 3.0788 2.7113 3.2325 1.2850 1.1546 1.1566 2.3206 1.6708 1.3638 1.3650 1.5825 1.7461 1.7768 1.9164 1.7834 2.3007 2.5991 2.1635 1.8707 1.8138 2.0179 2.1838 1.6899 2.1363 2.5520 1.3695 1.4100 1.3114 1.2530 1.2130 1.2176 1.1535 1.3596 1.2444 1.4383 1.4995 1.4860 1.6982 1.2176 1.2124 1.2264 1.0821 1.0736 1.0706 1.0735 1.0466 1.0446 1.0441 1.0502 1.0452 1.0676 1.0829 1.0886 1.0620 1.0626 1.0386 1.0559 1.0366 1.0379 1.0588 1.0602 1.0642 1.0955 1.0959 1.0963 1.1013 1.1001 1.0998 1.0989 1.1003 1.1008 1.0995 1.1010 1.1008 1.0655
irintensity: 0.1685 0.1188 0.1058 0.9201 0.1106 0.2401 1.4068 0.7931 3.1185 0.6230 17.7524 0.4192 110.3709 1.7546 0.2185 2.5075 1.7734 13.3901 5.7162 2.6212 13.6550 2.3792 6.1472 10.2570 5.6340 23.2819 1.7694 1.3037 8.5384 8.5281 5.2673 14.7405 12.7491 11.8687 0.5398 1.6444 8.7754 6.3678 16.7220 4.7738 23.6542 15.3197 12.8144 10.8014 4.6099 0.3950 9.5803 3.0371 2.5250 0.7498 11.7539 1.5563 7.5785 3.2226 1.3853 27.1716 8.7086 8.6756 11.6211 4.1291 2.2266 4.2574 7.0716 8.4651 5.0698 13.4569 7.0318 10.4774 18.4361 10.4136 6.7854 7.8895 41.2914 41.9018 29.5982 42.4350 31.4461 18.8153 53.2632 32.5348 7.2739 3.5784 23.7380 28.6755 32.1302 0.4934 37.9053 108.6584 40.8550 46.6873 99.5216 60.3556 4.5551
temp: 298.150 k
press: 1.00000 atm
elementType: 8 6 6 6 6 6 6 6 6 6 6 1 1 1 1 1 1 1 1 1 1 1 1 1 1 1 1 1 1 1 1 1 1
symmnumber: 1
zpe: 789308.6 jmol-1
zpe.correction: 0.300632 hartree
zpe.thermalcorrener: 0.315783 hartree
zpe.thermalcorrenthalpy: 0.316728 hartree
zpe.thermalcorrgfe: 0.258913 hartree
zpe.sumelectzpe: -468.537965 hartree
zpe.sumelectthermal: -468.522813 hartree
zpe.sumelectthermalent: -468.521869 hartree
zpe.sumelectthermalfe: -468.579683 hartree
dipole: -1.7514 0.0864 -0.8411
dipole: 1.9448
quadrupole: -73.5259 -71.3373 -73.0688
quadrupole: -1.0805 -3.3808 0.8312
quadrupole: -0.8819 1.3067 -0.4248 -1.0805 -3.3808 0.8312
hfenergy: -468.8385965 hartree
pointgroup: C01 [X(C10H22O1)]
dipole: -0.6884082 -0.0053946 -0.3339469 debye
polarizability: 124.2917984|-0.2111248|114.7695012|-0.7026454|0.4869544|99.1278342 unknown
InChI: InChI=1S/C10H22O/c1-4-7-10(11,8-5-2)9-6-3/h11H,4-9H2,1-3H3
charge 0 multiplicity 1
33 atoms
O  0.5714 0.465273 1.823498
C  0.19438 -0.038233 0.465575
C  1.527751 -0.573473 -0.113322
C  -0.371621 1.139793 -0.378889
C  -0.830461 -1.191101 0.663333
C  2.663346 0.467833 -0.242203
C  -1.742161 1.70009 0.06897
C  -1.357023 -1.872635 -0.62204
C  4.003478 -0.190598 -0.636351
C  -2.150922 2.946599 -0.746647
C  -2.399585 -2.968928 -0.310833
H  1.332405 -1.026648 -1.105611
H  1.870985 -1.38921 0.554405
H  0.368319 1.962001 -0.34419
H  -0.44176 0.823426 -1.439724
H  -1.700871 -0.801034 1.233346
H  -0.354353 -1.95174 1.313887
H  2.768672 0.996019 0.722869
H  2.398067 1.229755 -1.001242
H  -2.526205 0.924188 -0.032577
H  -1.706687 1.974372 1.145037
H  -1.81209 -1.115562 -1.291295
H  -0.513878 -2.321242 -1.181892
H  -0.253704 0.7737 2.278263
H  4.807006 0.561628 -0.741744
H  4.324159 -0.921896 0.129593
H  3.917868 -0.730264 -1.599374
H  -3.136404 3.334051 -0.429272
H  -1.410666 3.759398 -0.625215
H  -2.211885 2.708597 -1.825475
H  -2.759027 -3.458881 -1.234359
H  -1.968752 -3.751538 0.34176
H  -3.278483 -2.54544 0.211219
