program: Gaussian 09
title: 000137459
version: EM64L-G09RevD.01
frameworkgroup: C1[X(C11H15NO3)]
method: RPBEPBE
basis: SDD
operation: Freq
keyword: #p
keyword: freq=noraman
keyword: PBEPBE/SDD
title: #p freq=noraman PBEPBE/SDD
converged: YES YES NO NO
title: Mulliken charges:
elementType: O O O N C C C C C C C C C C C H H H H H H H H H H H H H H H
charge: -0.206362 -0.462582 -0.242279 -0.122974 0.386678 -0.434645 0.296494 -0.136072 0.246525 -0.534032 -0.018782 -0.622253 -0.297011 -0.813312 -0.809810 0.237578 0.258681 0.253561 0.253614 0.263271 0.242611 0.229010 0.204959 0.228127 0.279353 0.226172 0.227375 0.286524 0.225397 0.354185
chargesum: 0.00000
title: Mulliken charges with hydrogens summed into heavy atoms:
elementType: O O O N C C C C C C C C C C C
charge: -0.206362 -0.108397 -0.242279 -0.122974 0.386678 0.061613 0.296494 -0.136072 0.246525 -0.280471 -0.018782 0.137243 0.136957 -0.079661 -0.070514
polarizability: 1.94176955e+02 -2.58786492e+01 1.66614360e+02 6.78216637e+00 3.43847357e-01 8.28845176e+01
1716.lowfreq: -7.1872 -0.0009 -0.0008 -0.0004 9.2389 11.1967 36.2186 51.6140 71.5623
frequency: 36.1907 51.5350 71.5138 72.8795 97.0562 109.1932 122.0526 135.4066 169.5532 189.2050 231.6826 257.2842 261.5671 274.3517 301.0551 338.0093 349.0888 393.8931 420.2326 440.4711 465.8747 475.6566 499.7251 536.9079 563.4464 666.9799 686.6706 706.0733 793.6970 803.1084 831.9053 846.0541 872.4841 937.4809 962.1310 1010.5977 1016.6894 1033.2686 1049.2051 1057.8094 1099.4098 1107.7584 1108.3119 1157.3761 1180.0547 1204.9136 1216.8275 1273.1312 1282.4336 1317.5183 1345.5447 1357.0322 1382.0100 1387.0044 1392.3961 1399.5062 1443.0532 1453.7895 1460.7356 1463.6300 1465.0943 1471.6665 1473.0432 1483.4466 1484.7104 1507.9302 1541.1029 1579.5652 1635.3423 2952.5811 2971.4397 2978.1446 2996.3141 3009.8789 3025.4091 3042.0547 3051.8109 3074.2467 3094.7112 3104.9410 3109.5770 3132.3938 3172.9638 3582.2544
redmass: 4.5855 3.3358 2.3463 1.3949 3.4609 2.8545 1.1988 2.8176 1.3974 3.4709 2.6347 1.4432 2.2550 4.5828 2.6681 4.3080 3.7113 4.6265 4.8172 4.8861 3.1595 5.7604 3.4227 3.6750 2.6525 4.5844 4.4622 4.2868 3.2428 3.4776 2.6292 2.1264 2.6304 2.2556 2.2569 1.4456 2.3099 2.3318 1.6007 1.7415 2.0258 1.5270 1.8469 2.5323 2.4375 1.2510 1.3224 1.3531 4.3612 1.9267 3.2953 1.3599 1.4001 1.8897 1.2523 1.6134 1.1897 1.1123 1.0901 1.1384 1.1069 1.0492 1.0849 1.1815 1.0493 5.4936 7.4919 5.7585 8.6684 1.0586 1.0379 1.0390 1.0381 1.0711 1.0923 1.0961 1.0965 1.1035 1.0969 1.0976 1.0970 1.1020 1.0900 1.0667
irintensity: 2.9391 1.3406 6.0191 1.6839 10.1979 0.3681 0.2169 0.9858 2.1091 8.9580 20.9053 109.7609 28.5877 8.9730 0.7385 2.9775 1.8497 23.2853 14.4157 1.4052 4.6960 1.3715 13.6826 7.5892 5.0261 2.2093 1.1780 0.1583 12.6793 8.0773 6.6689 38.4165 20.4495 8.4017 1.1432 2.5406 138.1867 26.2316 0.6551 36.9373 4.9254 0.1195 1.2113 10.0860 66.6039 17.4644 22.2183 0.9818 98.6215 73.4427 12.9075 17.3024 67.1467 0.7796 60.4837 20.4453 21.7757 30.1130 30.0757 30.8274 25.3134 1.4442 8.3496 8.2328 34.3043 7.3100 323.8505 252.3377 3.8994 48.3609 32.2092 11.6791 27.9134 3.6661 81.6520 30.0354 3.7618 8.4359 11.9590 5.0745 3.8101 8.9245 12.4266 5.4421
temp: 298.150 k
press: 1.00000 atm
elementType: 8 8 8 7 6 6 6 6 6 6 6 6 6 6 6 1 1 1 1 1 1 1 1 1 1 1 1 1 1 1
symmnumber: 1
zpe: 634685.0 jmol-1
zpe.correction: 0.241739 hartree
zpe.thermalcorrener: 0.258150 hartree
zpe.thermalcorrenthalpy: 0.259094 hartree
zpe.thermalcorrgfe: 0.197390 hartree
zpe.sumelectzpe: -707.418310 hartree
zpe.sumelectthermal: -707.401898 hartree
zpe.sumelectthermalent: -707.400954 hartree
zpe.sumelectthermalfe: -707.462658 hartree
dipole: -2.8305 0.5454 1.0663
dipole: 3.0735
quadrupole: -74.2386 -103.6747 -85.0779
quadrupole: 13.0765 -1.0924 -1.3707
quadrupole: 13.4252 -16.0110 2.5858 13.0765 -1.0924 -1.3707
hfenergy: -707.6600485 hartree
pointgroup: C01 [X(C11H15N1O3)]
dipole: 1.1512934 0.2232162 -0.294716 debye
polarizability: 200.4270229|11.7012866|140.5246879|20.8115909|32.8329836|102.724122 unknown
InChI: InChI=1S/C11H15NO3/c1-7-8(2)11(15)9(6-10(7)14)12(3)4-5-13/h6,13H,4-5H2,1-3H3
charge 0 multiplicity 1
30 atoms
O  0.056209 2.070822 1.388133
O  4.278628 -0.428711 -1.23172
O  -2.09424 -2.185802 -1.267429
N  1.825684 -0.002024 0.522547
C  0.46931 -0.040456 0.241225
C  2.630863 -1.226987 0.338816
C  -1.862331 1.097348 0.329668
C  -0.414762 1.116834 0.686063
C  -2.422297 0.00803 -0.303912
C  -0.146484 -1.131363 -0.379731
C  -1.563684 -1.174669 -0.67376
C  2.58992 1.207499 0.922867
C  3.193683 -1.412615 -1.081185
C  -2.681112 2.306123 0.730564
C  -3.887903 -0.067161 -0.651929
H  2.023153 -2.10818 0.611282
H  3.487608 -1.185571 1.034916
H  0.412973 -2.005951 -0.719992
H  2.192365 2.106957 0.432547
H  3.632749 1.055443 0.603899
H  2.538158 1.375803 2.013646
H  2.399147 -1.255234 -1.837317
H  3.585888 -2.447569 -1.177883
H  -3.103428 2.81284 -0.158421
H  -2.058364 3.026223 1.283017
H  -3.536103 2.015993 1.36978
H  -4.519652 0.012986 0.253867
H  -4.100551 -1.024067 -1.153594
H  -4.184484 0.765356 -1.31871
H  4.590554 -0.409597 -2.170055
