program: Gaussian 09
title: 000137449
version: EM64L-G09RevD.01
frameworkgroup: C1[X(C9H16)]
method: RPBEPBE
basis: SDD
operation: Freq
keyword: #p
keyword: freq=noraman
keyword: PBEPBE/SDD
title: #p freq=noraman PBEPBE/SDD
converged: YES YES NO NO
title: Mulliken charges:
elementType: C C C C C C C C C H H H H H H H H H H H H H H H H
charge: -0.187286 -0.125811 -0.000681 -0.506832 -0.531661 -0.476339 -0.459198 -0.455471 -0.705080 0.238179 0.226370 0.211997 0.219217 0.219176 0.200509 0.225310 0.217030 0.211253 0.201362 0.223567 0.203564 0.204666 0.208750 0.224574 0.212836
chargesum: 0.00000
title: Mulliken charges with hydrogens summed into heavy atoms:
elementType: C C C C C C C C C
charge: 0.050894 0.100559 0.211316 -0.068439 -0.105843 -0.048057 -0.034268 -0.047241 -0.058921
polarizability: 9.88262339e+01 -2.43669792e-01 8.63589662e+01 2.04386929e-02 -1.76770216e-01 8.31351465e+01
1716.lowfreq: -16.3920 -0.0006 -0.0004 0.0002 13.8650 25.8039 79.9218 119.0218 199.6034
frequency: 79.7216 118.9764 199.4042 215.5430 302.5794 371.5435 384.5327 439.6967 481.8568 536.9386 696.6163 752.7542 772.9749 798.3353 802.7720 831.5613 879.5672 918.9493 934.1390 935.2990 949.3241 963.5625 970.5680 1006.9605 1014.6617 1032.2815 1073.1882 1082.7003 1110.5020 1116.2021 1127.2112 1167.5991 1177.0081 1207.3343 1230.8927 1241.8996 1253.9795 1261.7046 1271.7770 1289.3498 1295.5469 1303.2269 1320.8583 1330.3432 1346.5186 1385.1585 1462.1570 1467.7010 1471.3109 1473.7043 1481.2987 1486.7027 1498.2591 2954.3181 2965.9229 2972.9426 2987.4750 2990.0563 2998.1227 3006.9446 3012.1249 3042.6606 3045.0712 3051.9984 3062.1802 3065.3600 3067.3430 3071.6461 3072.8023
redmass: 2.7397 1.8406 1.3847 1.7821 1.8884 2.1406 2.5296 1.7723 2.4183 3.6887 2.3219 3.3839 1.9648 1.4660 1.6783 2.0522 2.5276 1.9426 2.2302 1.8917 1.9427 1.7855 1.7022 1.5548 1.9820 1.4446 2.1927 1.4046 1.2049 1.2439 1.2189 1.7212 2.1545 1.4057 1.3818 1.5625 1.3683 1.3254 1.3413 1.4073 1.6083 1.5072 1.4805 1.4421 1.5150 1.2147 1.0781 1.0845 1.0882 1.0443 1.0723 1.0691 1.0942 1.0821 1.0610 1.0365 1.0606 1.0592 1.0593 1.0631 1.1001 1.1033 1.0999 1.0910 1.0954 1.1006 1.1014 1.1038 1.0999
irintensity: 0.0005 0.0134 0.0298 0.0502 0.0824 0.4736 0.1013 0.2098 0.5176 0.1511 2.1215 2.2659 4.8592 1.9205 2.2310 5.2337 1.8503 0.5369 1.4770 7.6253 3.8487 3.3445 2.0863 0.1799 0.0648 1.8416 0.1980 0.5062 1.2858 0.2609 0.1692 4.2392 2.5380 2.0003 2.8878 0.7427 1.5637 0.8517 0.1912 3.3563 0.1268 2.1538 1.1771 2.8393 0.1781 16.7722 0.9389 6.7199 15.7350 11.8264 2.1814 10.6822 7.3471 15.2347 38.7664 31.0576 58.4433 31.6489 45.7053 52.2757 39.9813 15.6947 43.2358 83.1575 0.8032 1.9259 104.2629 129.6694 26.8120
temp: 298.150 k
press: 1.00000 atm
elementType: 6 6 6 6 6 6 6 6 6 1 1 1 1 1 1 1 1 1 1 1 1 1 1 1 1
symmnumber: 1
zpe: 602273.2 jmol-1
zpe.correction: 0.229394 hartree
zpe.thermalcorrener: 0.237897 hartree
zpe.thermalcorrenthalpy: 0.238841 hartree
zpe.thermalcorrgfe: 0.196440 hartree
zpe.sumelectzpe: -351.820037 hartree
zpe.sumelectthermal: -351.811534 hartree
zpe.sumelectthermalent: -351.810590 hartree
zpe.sumelectthermalfe: -351.852990 hartree
dipole: 0.0007 0.0535 0.0750
dipole: 0.0922
quadrupole: -57.8370 -57.3977 -57.4999
quadrupole: 0.5388 -0.2149 0.2182
quadrupole: -0.2588 0.1805 0.0783 0.5388 -0.2149 0.2182
hfenergy: -352.0494306 hartree
pointgroup: C01 [X(C9H16)]
dipole: -0.0004936 -0.020969 0.0295753 debye
dipolederiv: 0.0332431 -0.0004496 -0.053035 0.0206239 0.0614328 0.0268442 -0.0472435 0.0069213 0.09058 0.140244 -0.0371453 -0.0067264 -0.0218364 0.0911445 -0.0104845 -0.0202824 -0.0034916 0.0498009 0.0795741 0.0204514 -0.0141713 0.0738992 0.0596683 -0.0425514 -0.0081164 -0.057889 0.1099558 -0.0063901 0.0736252 0.0084838 0.0435662 0.071324 -0.0335192 0.0060004 -0.0237237 0.0043279 -0.0800763 -0.00263 0.0284554 -0.0242102 0.0827071 -0.0312545 0.02045 -0.0351719 0.0943971 0.0444425 0.0243187 0.0562777 -0.0066153 0.0616033 0.0512162 0.0751279 0.0460726 0.0172847 0.1020977 0.0462149 0.0175573 0.050034 -0.0179964 0.0249138 0.0174437 0.0375632 0.0720788 0.0838446 0.0248277 -0.0285258 0.0101977 0.1147223 -0.0380694 -0.0277215 -0.0192231 0.0818849 -0.0310156 0.0685576 0.0359318 0.0803586 0.0283779 -0.0402145 0.0086851 -0.0371527 0.0616077 -0.0118909 0.0661679 0.1099982 0.0606654 -0.029361 -0.0856703 0.1132578 -0.0800644 -0.0639707 -0.1631597 0.1222478 0.0308774 0.1173133 -0.0297497 -0.0136405 0.0335068 -0.011893 0.0574873 -0.0219272 -0.0344409 0.0556589 -0.0551987 -0.0325396 0.0957123 0.0698673 0.100886 -0.1271329 0.0694524 -0.0238404 0.0396386 0.0116246 -0.0563501 0.1598114 0.0030471 0.1160209 -0.0900503 -0.0903499 -0.1055563 -0.0871276 -0.1415962 -0.0473401 -0.0904637 -0.0506671 -0.0438458 0.0357017 0.0405065 -0.0186437 -0.0610532 -0.0112187 0.0537888 -0.0057039 -0.0467922 -0.0795572 -0.1764132 0.0321239 0.015725 0.008795 0.0217009 -0.187167 0.051654 -0.0025444 0.113165 0.0339337 -0.0014902 -0.1023407 -0.0157679 -0.0606877 -0.1574796 -0.0541952 -0.0130425 -0.0939509 0.0435323 -0.0689861 0.0976743 -0.0978215 0.0727826 0.0534287 0.0191129 -0.1243219 0.0586088 -0.0481764 0.0576149 -0.0000034 -0.0736105 0.0151206 0.0451837 -0.067791 -0.0062768 -0.0365576 -0.1830661 -0.1631789 -0.1067396 0.0573249 -0.1182615 -0.0151339 0.019653 -0.0021765 -0.0060306 0.0666927 -0.0285404 -0.0635614 -0.0364257 -0.0915461 -0.1499294 -0.0921416 -0.0329222 -0.0675088 0.0424952 0.0087252 -0.0083191 0.0995903 0.0166069 0.0177996 0.0995684 0.0775825 0.0769618 -0.1212543 0.0622557 -0.0053937 0.0464131 -0.0435774 0.0265814 0.1068417 0.1090464 0.0762688 -0.1136467 0.0716217 -0.1029895 -0.0168769 -0.0655517 -0.1284603 -0.0586968 -0.0020174 -0.0570782 0.0597779 -0.1587414 0.0522431 -0.1038606 0.0458059 0.0837448 0.0090685 -0.1498904 0.0206698 0.0021718 unknown
polarizability: 98.8162606|-0.4243601|86.3696091|-0.0649883|0.1697311|83.1344768 unknown
InChI: InChI=1S/C9H16/c1-2-8-5-7-3-4-9(8)6-7/h7-9H,2-6H2,1H3
charge 0 multiplicity 1
25 atoms
C  0.06564 0.610744 0.832261
C  1.706559 -0.643447 -0.142512
C  -0.717538 -0.647219 0.321159
C  1.415345 -0.036873 1.262171
C  0.416145 -1.482239 -0.393831
C  0.527024 1.49596 -0.365289
C  1.648082 0.625056 -1.046956
C  -1.957088 -0.386109 -0.563038
C  -3.045789 0.461423 0.131534
H  -0.468177 1.172976 1.617018
H  2.642301 -1.219001 -0.241318
H  -1.063497 -1.201785 1.21935
H  1.300169 -0.802016 2.052022
H  2.171233 0.703296 1.583158
H  0.214306 -1.600958 -1.475735
H  0.505482 -2.495507 0.039933
H  0.938742 2.451996 0.008085
H  -0.296224 1.746265 -1.056984
H  1.406214 0.366289 -2.094122
H  2.619313 1.153663 -1.051089
H  -2.387541 -1.364124 -0.860822
H  -1.647993 0.106535 -1.506978
H  -3.375302 -0.013477 1.07538
H  -2.667402 1.469962 0.379777
H  -3.934904 0.583388 -0.514276
