program: Gaussian 09
title: 000137431
version: EM64L-G09RevD.01
frameworkgroup: C1[X(C7H12O4)]
method: RPBEPBE
basis: SDD
operation: Freq
keyword: #pfreq=noraman
keyword: PBEPBE/SDD
title: #p freq=noraman PBEPBE/SDD
converged: YES YES NO NO
title: Mulliken charges:
elementType: O O O O C C C C C C C H H H H H H H H H H H H
charge: -0.429616 -0.414087 -0.209852 -0.231093 0.208100 -0.157832 -0.732404 -0.716161 -0.747255 0.119190 0.145539 0.285865 0.249642 0.237324 0.221947 0.230712 0.246928 0.223786 0.234557 0.251740 0.226378 0.381731 0.374863
chargesum: 0.00000
title: Mulliken charges with hydrogens summed into heavy atoms:
elementType: O O O O C C C C C C C
charge: -0.047885 -0.039225 -0.209852 -0.231093 0.208100 0.128033 -0.023491 -0.014736 -0.034580 0.119190 0.145539
polarizability: 9.80570424e+01 -3.95473139e+00 8.43060704e+01 -2.82718904e+00 -4.34865128e+00 7.78706175e+01
1716.lowfreq: -20.2008 -2.5857 0.0001 0.0007 0.0011 12.1578 38.2808 44.5171 68.6380
frequency: 38.2226 44.4288 68.4497 144.9559 184.5963 193.0423 214.8554 244.4872 247.9713 268.8663 272.2670 334.2625 336.9816 358.4789 462.0524 489.0515 536.1623 596.4295 609.9735 625.0477 679.5494 718.8559 752.8751 789.0133 856.4373 926.8942 948.2857 999.8726 1024.9624 1031.9203 1036.0686 1083.0099 1093.9402 1166.7914 1181.2203 1206.6406 1245.0992 1285.5726 1319.9504 1357.3627 1387.5504 1393.5532 1410.5504 1462.4349 1465.5974 1473.5295 1478.6382 1484.9183 1495.2871 1651.6608 1655.5602 2988.7684 2993.3039 3005.9066 3059.8095 3081.6315 3084.3894 3099.2515 3105.3931 3105.9323 3111.9439 3494.0876 3515.5226
redmass: 9.4553 7.3695 4.1963 4.7271 3.7579 1.0786 1.5578 2.1102 1.3590 1.5605 2.9388 4.0630 3.3899 2.7292 3.9865 3.6749 3.6838 1.2466 2.2411 2.1008 2.3532 5.0338 4.3806 2.8280 2.2372 2.3180 1.4961 1.4661 2.1976 2.3111 2.0428 1.5640 2.6513 2.2206 1.9315 2.6319 1.6640 2.3232 1.4303 1.7536 1.1874 1.1926 1.2016 1.0522 1.0499 1.0471 1.0523 1.0491 1.0609 8.7533 7.7894 1.0352 1.0358 1.0359 1.0853 1.1000 1.0996 1.0999 1.1005 1.0993 1.1004 1.0637 1.0641
irintensity: 0.2496 1.7734 0.5502 0.2760 0.0690 0.0891 0.5278 0.2162 0.4509 0.8560 3.4401 1.2758 3.8805 4.7992 6.3409 24.2867 38.8732 72.6137 70.1673 81.2743 38.9710 38.4259 20.1058 9.2077 7.0374 2.3074 1.5587 48.4370 35.5780 196.7211 199.8917 57.8248 48.5458 10.2923 3.7671 9.3821 0.9947 17.8263 2.9868 40.3169 5.5231 30.0602 34.1680 4.6178 1.7082 8.2300 23.2008 23.3521 5.1909 183.4377 211.4623 18.3599 17.5288 12.8829 0.9914 17.1539 32.4370 17.7259 14.7193 22.3443 11.8941 20.9402 25.1503
temp: 298.150 k
press: 1.00000 atm
elementType: 8 8 8 8 6 6 6 6 6 6 6 1 1 1 1 1 1 1 1 1 1 1 1
symmnumber: 1
zpe: 484368.7 jmol-1
zpe.correction: 0.184486 hartree
zpe.thermalcorrener: 0.197228 hartree
zpe.thermalcorrenthalpy: 0.198173 hartree
zpe.thermalcorrgfe: 0.145375 hartree
zpe.sumelectzpe: -573.981069 hartree
zpe.sumelectthermal: -573.968326 hartree
zpe.sumelectthermalent: -573.967382 hartree
zpe.sumelectthermalfe: -574.020179 hartree
dipole: -0.3773 2.0396 -1.0276
dipole: 2.3148
quadrupole: -66.7929 -68.3527 -63.1920
quadrupole: -0.0146 -2.8948 3.1297
quadrupole: -0.6803 -2.2402 2.9205 -0.0146 -2.8948 3.1297
hfenergy: -574.165555 hartree
pointgroup: C01 [X(C7H12O4)]
dipole: -0.1166839 0.5088482 -0.7462312 debye
dipolederiv: -0.3456292 -0.0930089 0.1926786 -0.0832771 -0.4413959 0.1899758 0.1330682 0.2049648 -1.1236707 -0.479029 0.2663301 -0.3400217 0.2357825 -0.7562647 0.3651082 -0.2921008 0.3172524 -0.6422086 -0.8495912 0.2514693 -0.2345784 0.1817781 -0.3907623 0.2024185 0.0225778 0.122653 -0.6255666 -0.7171067 -0.0757702 0.2671693 0.091189 -0.4892574 0.1639539 0.1063414 0.2609436 -0.6850074 -0.0567213 0.1065953 0.0760897 0.214318 0.0354605 -0.0239278 0.1293671 0.0000378 0.108017 -0.2035509 0.0883085 0.0248588 0.0950705 -0.0025243 0.0178861 0.0714487 0.0332856 0.0096227 -0.027109 -0.013516 0.0016027 -0.0164119 0.0010007 0.0272165 -0.0213997 0.0335021 -0.081892 -0.000099 -0.000978 0.0113365 -0.0535557 -0.0211185 0.0256599 0.0183643 -0.0056178 0.0113451 -0.0021213 0.0019288 -0.0035152 -0.0554246 -0.0220873 0.0080096 0.0047988 -0.0355283 0.0563994 1.1411566 -0.3046083 -0.0292627 -0.3068587 0.3568823 -0.3863033 -0.2107035 -0.3442166 1.2711317 1.1343189 -0.2868713 -0.062475 -0.447612 0.777288 -0.5866136 -0.0810692 -0.6177647 0.9203789 0.0956001 -0.0101672 -0.0024235 0.0047625 0.0160624 0.0548598 0.0114824 0.0365438 -0.0308243 -0.0397001 0.027378 0.1009057 0.042774 0.087641 0.0023656 0.0674267 0.000603 0.0878718 0.0983955 0.0448362 0.0011299 0.0355813 -0.1242097 0.0237921 0.019981 -0.0018167 0.084499 0.0025696 -0.0705569 -0.1184477 -0.0825935 0.0301341 -0.0788643 -0.0785447 -0.0517414 0.0028238 -0.0795737 0.0652569 0.0949962 0.0532264 0.0519737 -0.0159162 0.098904 -0.0183155 0.0509009 0.1059991 0.0129079 -0.0061284 0.0033149 0.0445258 0.0473022 -0.0062549 0.0951808 -0.0739032 -0.0429954 -0.0985936 -0.0995201 -0.0566844 0.0247792 -0.0353049 -0.1011667 -0.0711038 0.0336897 -0.1109059 0.0757694 0.05277 0.0689809 0.0505574 -0.0086638 0.035677 0.0032584 0.0922698 0.0908557 -0.018487 0.0473915 -0.0023288 0.054433 0.0355062 0.0464632 0.0967719 -0.0484304 0.0123288 -0.0759442 -0.1136313 -0.0477979 0.027858 -0.0483817 -0.1078512 -0.086201 -0.0324414 0.1124353 0.0708559 0.0307269 0.1069296 0.3426334 -0.0000681 -0.0348327 0.0193255 0.3317781 0.1604731 0.0368654 0.1083483 0.0188371 0.3463907 0.0199891 0.1680227 0.0079831 0.2832169 unknown
polarizability: 97.5772076|-5.6471021|79.5542361|-0.6125638|-5.045271|83.1022866 unknown
InChI: InChI=1S/C7H12O4/c1-4(5(8)9)7(2,3)6(10)11/h4,8,10H,1-3H3
charge 0 multiplicity 1
23 atoms
O  2.026462 0.410112 -1.510027
O  -2.48743 1.069686 -1.042453
O  2.865514 -0.532174 0.430393
O  -2.636263 -0.33052 0.797833
C  0.512969 0.307439 0.402796
C  -0.562456 -0.323264 -0.578574
C  0.426276 -0.262268 1.837589
C  0.360568 1.860299 0.429665
C  -0.49091 -1.868159 -0.647605
C  1.90547 -0.005376 -0.171472
C  -1.967493 0.099164 -0.169597
H  -0.371124 0.104433 -1.576707
H  -0.593016 -0.131621 2.237212
H  0.679978 -1.334619 1.868146
H  1.140995 0.26026 2.496324
H  -0.581254 2.135402 0.937219
H  0.347322 2.281416 -0.589284
H  1.191521 2.320978 0.993611
H  0.537198 -2.200721 -0.876805
H  -0.806521 -2.325434 0.304606
H  -1.153507 -2.24995 -1.444483
H  2.950312 0.218638 -1.827287
H  -3.406613 1.315879 -0.7445
