program: Gaussian 09
title: 000137421
version: EM64L-G09RevD.01
frameworkgroup: C1[X(C13H7BrF3NO3)]
method: RPBEPBE
basis: SDD
operation: Freq
keyword: #p
keyword: freq=noraman
keyword: PBEPBE/SDD
title: #p freq=noraman PBEPBE/SDD
converged: NO YES NO NO
title: Mulliken charges:
elementType: Br F F F O O O N C C C C C C C C C C C C C H H H H H H H
charge: 0.062881 -0.168853 -0.141496 -0.152681 -0.281033 -0.183359 -0.162129 0.008280 0.151662 0.342926 0.376969 -0.495668 -0.300834 -0.323847 0.289136 0.419378 -0.378327 -0.324687 -0.185901 -0.203089 -0.228234 0.310445 0.275951 0.276404 0.270059 0.257864 0.243967 0.244215
chargesum: 0.00000
title: Mulliken charges with hydrogens summed into heavy atoms:
elementType: Br F F F O O O N C C C C C C C C C C C C C
charge: 0.062881 -0.168853 -0.141496 -0.152681 -0.281033 -0.183359 -0.162129 0.008280 0.151662 0.342926 0.376969 -0.185222 -0.024883 -0.047444 0.289136 0.419378 -0.378327 -0.054628 0.071963 0.040879 0.015981
polarizability: 2.38076284e+02 3.90280550e+01 1.52395496e+02 4.33428658e-01 5.63866905e+00 1.44211556e+02
1716.lowfreq: -17.8538 -6.0981 -2.6306 0.0002 0.0006 0.0007 10.2561 16.2906 38.0693
frequency: -1.9999 16.0064 38.0563 53.4671 66.2411 88.8755 121.5857 134.7864 155.9636 167.9498 182.6152 224.0358 230.3697 264.1363 297.3191 307.5758 343.2286 376.1160 406.2622 423.6915 442.9089 445.0851 466.2195 492.3150 514.2291 553.9458 577.8229 593.4336 615.4665 641.5083 662.8967 673.2646 696.2143 718.0391 735.6086 742.8225 772.9672 800.5090 838.6528 864.6865 904.3931 922.8137 949.7854 968.6117 983.8557 989.0610 997.9682 1008.4187 1016.8932 1033.0263 1068.0446 1116.0106 1163.3697 1171.6531 1181.2141 1213.8445 1219.4522 1252.5527 1257.1573 1279.5027 1365.4844 1370.6534 1391.4989 1421.8124 1431.6348 1448.5194 1490.1000 1575.7952 1579.2014 1583.7297 1623.2472 3146.3974 3157.9122 3168.8740 3169.5575 3180.9321 3187.2682 3191.6000
redmass: 13.1296 11.4926 16.3816 6.4697 9.9512 10.5410 4.8395 8.0097 8.4455 12.9620 10.8851 9.0761 8.0121 12.7495 7.2028 10.5114 10.3865 8.9419 7.4926 4.2262 5.7667 4.2050 7.9532 6.7469 7.7987 6.1893 5.6714 6.8370 5.1229 6.9374 7.4091 7.7869 7.5619 3.8822 4.9306 4.5458 1.5453 7.1870 1.4012 1.4053 1.5361 6.2417 1.3763 1.3675 8.9661 1.3290 10.9190 7.5221 10.3727 2.1451 2.2930 1.6358 1.5219 1.0998 2.3490 6.2334 3.7026 1.5001 3.8208 1.6162 11.3255 4.8486 13.4356 2.1150 5.7162 2.5002 3.0469 8.0699 6.9231 6.9872 7.2050 1.0862 1.0905 1.0893 1.0952 1.1010 1.0958 1.0932
irintensity: 0.0842 0.3761 0.0497 0.1328 1.5718 0.2378 0.0417 0.5262 2.0302 0.4026 1.1941 1.8578 1.0265 1.9013 2.1694 2.0014 1.4515 1.4774 4.8413 1.3205 10.9048 11.3824 3.8936 1.4236 4.6875 7.7157 6.6697 7.5734 3.4833 13.2831 2.6813 0.3777 2.6736 5.7358 5.5009 33.1975 80.7584 33.2307 46.4225 1.2346 21.1678 14.3286 1.5871 12.4571 163.6790 0.3161 168.5189 43.6577 209.2798 13.0482 46.4647 3.4972 5.2230 1.0635 14.8769 68.2084 311.1340 12.6969 586.0402 37.3437 1.3990 3.5380 141.4515 25.9260 13.5899 128.3071 62.2713 5.9828 8.5439 40.6560 154.1172 0.8423 7.1955 1.4078 4.6709 10.2461 1.4179 8.4369
temp: 298.150 k
press: 1.00000 atm
elementType: 35 9 9 9 8 8 8 7 6 6 6 6 6 6 6 6 6 6 6 6 6 1 1 1 1 1 1 1
symmnumber: 1
zpe: 460136.0 jmol-1
zpe.correction: 0.175257 hartree
zpe.thermalcorrener: 0.192728 hartree
zpe.thermalcorrenthalpy: 0.193673 hartree
zpe.thermalcorrgfe: 0.127319 hartree
zpe.sumelectzpe: -1091.402526 hartree
zpe.sumelectthermal: -1091.385054 hartree
zpe.sumelectthermalent: -1091.384110 hartree
zpe.sumelectthermalfe: -1091.450463 hartree
dipole: 8.6577 3.9268 -0.5558
dipole: 9.5228
quadrupole: -140.0037 -125.0607 -130.9486
quadrupole: 6.3045 0.6192 5.7962
quadrupole: -7.9993 6.9436 1.0557 6.3045 0.6192 5.7962
hfenergy: -1091.5777822 hartree
pointgroup: C01 [X(C13H7Br1F3N1O3)]
dipole: 3.4197149 1.1418895 1.0190014 debye
polarizability: 238.641881|24.2422718|141.5739443|29.7110039|2.9846443|154.4675113 unknown
InChI: InChI=1S/C13H7BrF3NO3/c14-10-3-1-2-4-12(10)21-8-5-6-9(13(15,16)17)11(7-8)18(19)20/h1-7H
charge 0 multiplicity 1
28 atoms
Br 2.933849 -0.375907 -2.401815
F  -3.421724 2.611904 0.134788
F  -3.976914 1.368811 -1.656755
F  -4.508112 0.656407 0.442023
O  1.64694 -1.21338 0.371047
O  -2.985357 -2.946637 0.106795
O  -3.997237 -1.436508 -1.27321
N  -3.064155 -1.794111 -0.465374
C  -2.155456 0.584777 -0.205081
C  -1.957087 -0.824816 -0.20628
C  0.424371 -0.554094 0.178937
C  -0.692874 -1.397157 -0.001969
C  -1.014763 1.396919 -0.007579
C  0.269872 0.850164 0.173292
C  -3.497888 1.27011 -0.333732
C  2.837933 -0.451044 0.525683
C  3.586297 -0.026869 -0.597669
C  3.319193 -0.220521 1.831776
C  4.818211 0.636838 -0.412609
C  4.550556 0.443569 2.018179
C  5.297026 0.872884 0.896556
H  -0.575355 -2.483012 0.00828
H  -1.1396 2.4822 0.020587
H  1.130136 1.509575 0.314562
H  2.725862 -0.577295 2.6793
H  5.397102 0.957981 -1.283321
H  4.925263 0.619174 3.031314
H  6.25511 1.384236 1.033074
