program: Gaussian 09
title: 000137392
version: EM64L-G09RevD.01
frameworkgroup: C1[X(C19H21F3N5S)]
method: RPBEPBE
basis: SDD
operation: Freq
keyword: #p
keyword: freq=noraman
keyword: PBEPBE/SDD
title: #p freq=noraman PBEPBE/SDD
converged: YES YES NO NO
title: Mulliken charges:
elementType: S F F F N N N N N C C C C C C C C C C C C C C C C C C C H H H H H H H H H H H H H H H H H H H H H
charge: 0.290356 -0.135672 -0.212733 -0.156839 -0.111813 -0.234390 -0.062747 -0.002526 -0.029093 -0.357616 -0.431581 -0.526059 -0.567906 -0.553292 -0.543147 0.560847 0.549291 -0.388670 -0.352748 -0.423125 -0.291206 0.307357 -0.241385 -0.381177 -0.400258 -0.418206 0.287572 0.240113 0.273923 0.266806 0.250246 0.271382 0.256185 0.280567 0.301512 0.266157 0.262093 0.276662 0.266466 0.266031 0.276772 0.267106 0.265881 0.230356 0.223535 0.267810 0.271549 0.281680 0.263932
chargesum: 1.00000
title: Mulliken charges with hydrogens summed into heavy atoms:
elementType: S F F F N N N N N C C C C C C C C C C C C C C C C C C C
charge: 0.290356 -0.135672 -0.212733 -0.156839 -0.111813 -0.234390 -0.062747 -0.002526 -0.029093 0.183113 0.090048 0.010693 0.261857 0.255868 0.266612 0.560847 0.549291 -0.388670 -0.352748 -0.192769 -0.067671 0.307357 0.026425 -0.109628 -0.118579 -0.154274 0.287572 0.240113
polarizability: 4.33691362e+02 1.61456643e+01 2.84572101e+02 1.80561192e+01 -1.32411231e+01 1.45602343e+02
1716.lowfreq: -6.4655 -5.3116 -0.0009 0.0012 0.0016 8.3455 18.1126 21.4833 23.9023
frequency: 17.6175 21.4074 23.8773 25.3510 52.8684 62.2675 70.2674 85.5780 89.5397 92.8030 121.3998 127.4788 152.7417 172.5627 179.1739 196.9930 210.3603 233.4777 244.6701 258.0788 263.7562 271.0602 305.0289 306.3954 340.0065 345.1135 354.6685 361.2946 382.7880 397.9382 403.5114 420.5685 432.6186 438.9215 441.2808 455.2377 457.5721 465.9930 483.2022 487.0654 500.2903 520.0270 543.0119 575.9472 614.2637 626.4878 629.9424 646.0150 674.8291 683.4523 710.1202 719.6313 720.5218 749.6661 768.7018 802.1026 815.6505 832.7639 842.8949 861.3829 873.0803 875.1070 915.4890 924.6565 934.4244 935.0628 946.0015 961.0224 977.1457 1010.0843 1027.2192 1037.4206 1044.9325 1053.0918 1070.4054 1089.1282 1102.3051 1110.4399 1116.1362 1133.9599 1150.9656 1161.5611 1184.3282 1214.8215 1233.4707 1237.5216 1248.9590 1258.1549 1275.2428 1289.1087 1298.5960 1301.0564 1322.0982 1329.1888 1348.3500 1369.0801 1371.5224 1382.3332 1393.1844 1415.1484 1422.6790 1423.0525 1426.2853 1450.9354 1455.2984 1460.4186 1466.3394 1471.6374 1475.3143 1481.3376 1487.9811 1490.2431 1493.7532 1499.5048 1502.4704 1560.3170 1585.0069 1596.5928 1618.7024 2048.8552 3002.8350 3007.1717 3021.9695 3024.4523 3027.8881 3031.3173 3064.7799 3076.7135 3094.4313 3140.9229 3141.0163 3142.6133 3144.7309 3147.6978 3153.4644 3156.8013 3157.6641 3158.2961 3181.3529 3184.4567 3198.9323
redmass: 3.2030 14.3137 6.3342 7.8070 4.4806 6.0444 7.5653 8.1377 2.5266 3.9933 5.0046 5.3754 3.8771 4.6620 2.0471 9.0076 1.7196 6.8693 9.1102 1.4547 1.5391 1.3393 5.6568 6.8317 2.9448 3.0859 8.3620 4.2579 7.9263 4.0093 3.7750 3.8792 2.4221 3.8881 4.5519 9.9386 3.9023 4.7965 4.2737 5.2161 7.8473 3.6446 7.3415 3.8368 8.1098 5.9595 6.6173 7.7872 7.3793 5.9638 2.9186 3.5273 2.8076 3.4180 1.7371 1.4477 1.8242 1.4392 4.2960 2.5106 1.9640 2.1902 3.2855 3.9053 4.1878 1.3842 2.2756 1.4502 3.8863 6.4215 3.5472 6.5817 1.1997 2.1405 1.7413 3.2641 2.7448 5.0268 1.5890 1.6209 1.5183 1.3103 1.3668 1.7583 1.9649 1.9540 1.8745 1.4849 1.5646 1.6264 2.1644 1.3279 1.6115 1.8017 2.6775 3.1518 1.4175 1.2900 7.2998 4.5478 1.6117 2.0339 1.1475 1.0965 1.0468 1.1083 1.0515 1.0646 2.7133 1.1437 1.0571 1.0773 2.4008 1.1300 1.0720 6.8684 7.9587 6.3023 7.1661 13.9763 1.0656 1.0600 1.0557 1.0346 1.0321 1.0339 1.1021 1.1017 1.1048 1.0925 1.1056 1.1055 1.1050 1.1054 1.1055 1.1050 1.0902 1.0871 1.0965 1.0963 1.0888
irintensity: 0.8980 0.8956 2.7746 0.3795 3.2837 2.9419 2.3917 1.2491 0.1885 1.7882 1.6434 0.7699 3.7060 1.1689 1.8071 2.2020 0.1556 1.0965 0.7104 0.1156 0.3999 0.3390 1.1301 0.5167 0.1462 0.9199 1.9716 0.8735 8.3648 3.0364 3.8536 0.2617 0.6625 1.0897 0.5740 1.8366 6.0055 10.5450 2.1823 7.9527 2.5979 6.0329 1.5785 4.6781 11.6839 8.8191 18.2321 0.7021 4.5348 9.3426 3.2307 1.0057 4.5620 2.2690 27.1845 38.9551 5.5657 91.1572 64.2481 4.0236 22.5075 50.9152 55.3930 113.7982 111.9781 7.0133 9.2104 9.3495 38.7878 199.5795 9.7842 22.0578 0.4193 10.6196 18.2630 112.5366 43.7336 5.0370 14.4538 15.5461 19.4474 2.9009 12.0509 6.4359 62.5556 200.3367 5.5206 37.5400 32.6357 22.5619 185.7242 82.7899 111.1496 40.4507 19.7437 32.5461 30.1913 5.1095 38.7022 10.5250 40.9640 184.9716 20.1155 0.5318 0.2940 9.2397 3.9401 15.6513 314.4768 40.2559 54.1624 25.2221 182.5274 34.4714 79.1056 5.0315 12.9663 47.5857 22.9136 687.6018 18.8149 9.2203 11.9712 7.6622 0.7907 8.1615 0.2050 2.0043 20.9302 0.9225 0.4051 1.7147 2.7517 7.3841 0.1058 10.8928 0.1630 21.2452 6.1863 0.4526 12.5304
temp: 298.150 k
press: 1.00000 atm
elementType: 16 9 9 9 7 7 7 7 7 6 6 6 6 6 6 6 6 6 6 6 6 6 6 6 6 6 6 6 1 1 1 1 1 1 1 1 1 1 1 1 1 1 1 1 1 1 1 1 1
symmnumber: 1
zpe: 991036.0 jmol-1
zpe.correction: 0.377466 hartree
zpe.thermalcorrener: 0.404440 hartree
zpe.thermalcorrenthalpy: 0.405384 hartree
zpe.thermalcorrgfe: 0.317987 hartree
zpe.sumelectzpe: -1705.613840 hartree
zpe.sumelectthermal: -1705.586865 hartree
zpe.sumelectthermalent: -1705.585921 hartree
zpe.sumelectthermalfe: -1705.673319 hartree
dipole: -11.7302 14.1185 0.3591
dipole: 18.3592
quadrupole: -133.2193 -102.5863 -165.9672
quadrupole: -53.1622 -4.3426 -1.1931
quadrupole: 0.7049 31.3380 -32.0429 -53.1622 -4.3426 -1.1931
hfenergy: -1705.9913055 hartree
pointgroup: C01 [X(C19H21F3N5S1)]
dipole: 2.5909239 -6.7354461 0.3056233 debye
polarizability: 427.2209408|-32.6941917|291.2868132|-19.4951999|14.1587016|145.3580516 unknown
InChI: InChI=1S/C19H21F3N5S/c1-27(2,3)10-4-9-26-15-7-6-14(24-25-23)12-18(15)28-17-8-5-13(11-16(17)26)19(20,21)22/h5-8,11-12H,4,9-10H2,1-3H3
charge 1 multiplicity 1
49 atoms
S  -1.50385 2.943845 -0.615666
F  5.108852 1.815204 0.781917
F  4.31174 -0.32108 0.731623
F  4.832055 0.740195 -1.194685
N  2.226864 -4.098276 0.325762
N  -0.518903 -0.021379 -0.872545
N  -6.022288 0.488074 0.60988
N  -6.599045 1.59726 0.831022
N  -7.317133 2.507041 1.076624
C  1.548721 -3.201083 -0.747931
C  0.38132 -2.333431 -0.253178
C  -0.063944 -1.324379 -1.381157
C  2.834875 -3.245826 1.44348
C  1.225136 -5.085845 0.918267
C  3.352025 -4.877912 -0.360395
C  0.478254 0.924461 -0.50006
C  -1.896795 0.132634 -0.496456
C  0.162917 2.297831 -0.263391
C  -2.467211 1.417886 -0.28828
C  1.83504 0.541579 -0.370354
C  -2.747449 -0.992395 -0.321652
C  2.833544 1.470698 0.001952
C  1.158071 3.212036 0.1362
C  -3.808867 1.577403 0.097249
C  2.506344 2.813511 0.268958
C  -4.102337 -0.848587 0.025243
C  -4.64396 0.438329 0.245723
C  4.2422 0.974167 0.07999
H  1.221203 -3.886788 -1.550407
H  2.363376 -2.571944 -1.151428
H  -0.478296 -2.958432 0.043975
H  0.674601 -1.7366 0.627485
H  0.778963 -1.13627 -2.072434
H  -0.871357 -1.764927 -1.988235
H  3.495836 -2.482113 1.006291
H  2.032281 -2.758193 2.014167
H  3.410216 -3.906045 2.11061
H  0.438114 -4.534822 1.45154
H  0.783342 -5.683202 0.105917
H  1.753061 -5.746667 1.622698
H  4.090557 -4.166184 -0.759971
H  3.834493 -5.538112 0.376252
H  2.92891 -5.478685 -1.18002
H  2.143977 -0.48658 -0.555909
H  -2.364269 -2.006261 -0.460801
H  0.879272 4.252871 0.327057
H  -4.205204 2.584973 0.266076
H  3.273007 3.531746 0.570137
H  -4.74876 -1.722926 0.138859
