program: Gaussian 09
title: 000137371
version: EM64L-G09RevD.01
frameworkgroup: C1[X(C18H16N4O2)]
method: RPBEPBE
basis: SDD
operation: Freq
keyword: #p
keyword: freq=noraman
keyword: PBEPBE/SDD
title: #p freq=noraman PBEPBE/SDD
converged: YES YES NO NO
title: Mulliken charges:
elementType: O O N N N N C C C C C C C C C C C C C C C C C C H H H H H H H H H H H H H H H H
charge: -0.177103 -0.176480 -0.342159 -0.148513 -0.130931 -0.108971 0.502569 0.414386 -0.345454 -0.336429 0.153821 0.153574 0.169143 -0.315503 -0.332280 -0.360970 -0.303396 0.151760 -0.254190 -0.254201 -0.312025 -0.364411 -0.645810 -0.645068 0.268025 0.265118 0.238183 0.240180 0.249371 0.274671 0.277261 0.277283 0.272342 0.246080 0.240302 0.219722 0.240313 0.240066 0.219737 0.239983
chargesum: 0.00000
title: Mulliken charges with hydrogens summed into heavy atoms:
elementType: O O N N N N C C C C C C C C C C C C C C C C C C
charge: -0.177103 -0.176480 -0.342159 -0.148513 -0.130931 -0.108971 0.502569 0.414386 -0.077429 -0.071311 0.153821 0.153574 0.169143 -0.077319 -0.092100 -0.111599 -0.028724 0.151760 0.023072 0.023082 -0.039683 -0.118330 0.054526 0.054718
polarizability: 6.58823618e+02 -9.37096195e+00 2.21426895e+02 -6.65870402e-01 2.67747581e+00 1.08291978e+02
1716.lowfreq: -3.5982 -0.0008 -0.0003 0.0013 3.0815 5.4604 18.8772 21.0391 39.0374
frequency: 18.8715 21.0251 39.0373 48.9239 54.9481 72.7833 92.2461 108.7154 118.5270 133.3318 155.1649 165.5242 191.6846 204.8855 237.5257 258.2694 276.3113 280.7526 305.1957 349.5752 377.2691 397.9831 404.4385 423.2314 436.2219 454.0556 462.9825 512.8616 526.6891 538.7433 545.3825 571.6867 608.7707 620.9063 627.6468 636.6027 672.1270 683.5609 728.8876 733.4875 734.8087 748.7379 805.8335 820.8050 821.4069 830.6283 833.0743 852.9368 899.4970 938.2445 939.5656 941.6051 962.7438 966.1594 984.1060 984.6177 987.8958 996.8817 1002.7145 1056.0613 1056.2741 1090.5866 1104.1230 1111.0831 1118.6241 1123.2978 1144.4282 1161.8809 1168.1240 1193.2968 1205.9877 1255.0476 1259.8613 1286.5109 1303.3100 1308.1476 1335.1136 1342.4679 1363.5154 1376.7425 1383.9668 1428.4970 1431.4096 1455.4517 1459.4021 1464.9721 1477.7857 1490.0627 1491.6308 1500.5990 1520.7764 1551.5473 1572.7117 1592.0025 1610.4138 1620.3066 1625.2287 1674.5611 2948.7468 2955.5916 3017.3772 3020.4658 3101.6409 3111.4653 3146.3211 3150.1148 3156.4231 3163.2906 3169.4053 3173.4692 3185.1934 3190.4353 3206.2639 3234.9553
redmass: 4.2884 5.8411 5.7660 4.2550 4.7396 2.3095 6.0659 4.3360 1.7875 5.8941 4.4123 4.1740 1.2126 4.3671 8.5065 3.0757 4.8349 4.2472 6.8766 5.5063 5.2756 5.2058 3.4254 4.2380 3.6970 5.0420 4.0266 2.5840 5.2375 4.6464 2.6577 3.4385 8.1985 3.4484 4.0617 6.0354 5.9695 7.9367 5.8073 3.8097 6.8144 3.9192 1.2673 6.4211 1.9332 1.3284 1.6509 1.6962 7.5920 6.3556 3.1876 1.3120 1.3565 1.3982 1.3486 1.3828 2.8413 4.0617 2.6150 1.5059 1.2367 4.0115 1.2376 1.3283 1.4793 1.3594 1.9646 1.4515 1.4344 2.8926 1.7098 3.0083 2.8105 1.7201 1.3746 1.5436 5.6403 6.7936 3.1084 5.7345 6.1507 3.3562 1.2415 1.8783 1.6682 1.0408 1.0457 2.4487 1.1411 1.3672 1.9921 6.4093 7.4531 7.0022 6.3177 11.3425 6.2599 11.4598 1.0367 1.0391 1.0997 1.1028 1.0966 1.0946 1.0880 1.0866 1.0898 1.0884 1.0954 1.0959 1.0957 1.0958 1.0893 1.1110
irintensity: 0.1350 2.4964 2.3366 0.6770 0.3418 0.0084 6.2309 1.7147 1.0566 3.4243 1.0915 1.9336 0.0881 2.4058 2.1971 6.3618 3.0072 0.1725 19.2764 0.9466 0.9833 2.9696 2.2184 0.3716 0.1737 0.4798 6.0467 0.3416 18.7449 4.4099 24.7233 17.6810 15.4373 3.8111 4.1651 9.3299 9.9602 49.1191 6.2970 1.2236 3.7409 2.3507 3.3644 1.1392 50.8442 2.9169 47.2448 104.3880 2.8731 35.7612 26.0042 0.2235 0.6586 6.1885 0.2379 4.4619 0.3213 11.9063 0.8309 26.2708 51.6770 43.2131 0.0115 1.0883 12.5247 37.2241 110.3355 49.3216 145.8880 71.4356 0.0390 21.2704 5.2708 1.5392 0.7114 75.0976 311.4720 879.4455 169.4605 37.7870 2.6976 14.3588 10.5654 12.6245 11.4945 0.3156 23.4687 200.3350 0.7085 0.0888 257.6173 60.9788 11.5476 33.4605 20.1781 407.0325 656.9422 26.1534 89.7100 214.2023 6.7441 70.1846 3.7117 51.1052 5.1399 4.9809 4.9492 0.8037 19.0916 26.3123 5.2204 7.3743 0.0014 1.7564
temp: 298.150 k
press: 1.00000 atm
elementType: 8 8 7 7 7 7 6 6 6 6 6 6 6 6 6 6 6 6 6 6 6 6 6 6 1 1 1 1 1 1 1 1 1 1 1 1 1 1 1 1
symmnumber: 1
zpe: 800278.2 jmol-1
zpe.correction: 0.304810 hartree
zpe.thermalcorrener: 0.326206 hartree
zpe.thermalcorrenthalpy: 0.327151 hartree
zpe.thermalcorrgfe: 0.251925 hartree
zpe.sumelectzpe: -1063.240151 hartree
zpe.sumelectthermal: -1063.218754 hartree
zpe.sumelectthermalent: -1063.217810 hartree
zpe.sumelectthermalfe: -1063.293036 hartree
dipole: -4.6668 0.0436 0.0315
dipole: 4.6671
quadrupole: -45.9905 -140.0275 -145.0986
quadrupole: 3.3343 0.1330 9.1076
quadrupole: 64.3816 -29.6553 -34.7264 3.3343 0.1330 9.1076
hfenergy: -1063.5449605 hartree
pointgroup: C01 [X(C18H16N4O2)]
dipole: 1.835696 0.0422323 -0.0068576 debye
polarizability: 658.4585539|15.8137524|217.6520236|0.5271165|-21.3860356|112.4319127 unknown
InChI: InChI=1S/C18H16N4O2/c1-21(2)15-7-3-13(4-8-15)19-20-14-5-9-16(10-6-14)22-17(23)11-12-18(22)24/h3-12H,1-2H3
charge 0 multiplicity 1
40 atoms
O  -5.411223 -2.337503 -0.439135
O  -5.127905 2.309775 0.362802
N  -4.822248 -0.044038 -0.021127
N  7.232225 0.049533 0.052539
N  0.84915 -0.539858 0.258289
N  1.575648 0.467585 -0.179175
C  -3.387826 -0.142357 0.039068
C  5.841751 0.128914 0.006623
C  -2.778775 -1.306407 0.572299
C  -2.582641 0.927669 -0.438505
C  -5.723975 -1.138213 -0.251246
C  -5.583414 1.163579 0.139214
C  -0.561573 -0.330797 0.151857
C  5.021585 -0.955002 0.479272
C  5.180528 1.291581 -0.512918
C  -1.375999 -1.395356 0.619687
C  -1.183845 0.836237 -0.377452
C  2.976629 0.281766 -0.085285
C  -7.112852 -0.558795 -0.23003
C  -7.031255 0.778134 -0.004648
C  3.627201 -0.878845 0.433266
C  3.781839 1.357097 -0.553452
C  7.890939 -1.149009 0.592753
C  8.050448 1.168991 -0.436179
H  -3.393259 -2.135109 0.929939
H  -3.054678 1.82682 -0.841071
H  5.487837 -1.858139 0.882998
H  5.761889 2.139958 -0.88301
H  -0.883159 -2.285453 1.023433
H  -0.548901 1.650655 -0.737791
H  -7.990939 -1.185928 -0.383595
H  -7.82592 1.519556 0.077508
H  3.006279 -1.705329 0.793031
H  3.274388 2.243556 -0.949007
H  7.61812 -1.324773 1.652501
H  8.983134 -1.020355 0.541234
H  7.6276 -2.057188 0.014835
H  7.862033 1.375013 -1.508842
H  9.116996 0.921993 -0.320324
H  7.851469 2.099938 0.131644
