program: Gaussian 09
title: 000011573
version: EM64L-G09RevD.01
frameworkgroup: C1[X(C7H12)]
method: RPBEPBE
basis: SDD
operation: Freq
keyword: #p
keyword: freq=noraman
keyword: PBEPBE/SDD
title: #p freq=noraman PBEPBE/SDD
converged: YES YES NO NO
title: Mulliken charges:
elementType: C C C C C C C H H H H H H H H H H H H
charge: -0.082633 -0.416633 -0.427057 -0.430774 -0.208058 -0.197373 -0.715566 0.201512 0.194283 0.203533 0.204792 0.202911 0.209410 0.209514 0.204131 0.198768 0.212025 0.215172 0.222044
chargesum: 0.00000
title: Mulliken charges with hydrogens summed into heavy atoms:
elementType: C C C C C C C
charge: 0.118879 -0.018817 -0.019354 -0.011850 -0.003928 0.001395 -0.066326
polarizability: 8.63777644e+01 -3.63407828e-01 6.95388214e+01 -2.97792802e+00 -2.21719655e-01 5.70714703e+01
1716.lowfreq: -4.0245 -0.0003 0.0002 0.0007 7.9868 20.3565 113.9090 210.5743 232.2191
frequency: 113.8392 210.5733 232.2184 273.2083 363.1873 439.6429 471.7159 533.5095 697.9272 723.2330 760.2601 842.6767 859.6713 889.6269 948.7838 974.4570 981.6785 993.2174 1031.5566 1078.7471 1098.3931 1123.6684 1138.7173 1177.5285 1235.6736 1251.9328 1297.1452 1317.1561 1329.8120 1333.6782 1348.7875 1372.8663 1391.1692 1453.4816 1462.5663 1472.2053 1475.1567 1480.1828 1670.3781 2948.8042 2949.7224 2971.0477 2976.3919 2981.8691 3005.6424 3030.0700 3044.1896 3066.9463 3074.2831 3079.6753 3113.8508
redmass: 2.3570 1.1662 1.7741 2.0985 1.8860 2.1752 3.5339 2.7465 1.6811 1.5576 2.8390 1.8351 1.8309 2.1794 2.0858 1.3095 1.5235 1.7101 1.9647 1.6733 1.7381 1.5194 1.0680 1.4328 1.2476 1.2079 1.3456 1.7623 1.3694 1.4946 1.5192 1.3260 1.4071 1.0888 1.0697 1.0859 1.0593 1.0624 6.7252 1.0791 1.0641 1.0372 1.0606 1.0663 1.0919 1.0995 1.1034 1.0996 1.0990 1.0843 1.0988
irintensity: 0.2896 0.0305 0.0713 0.1890 0.6029 3.2198 0.1471 4.4070 21.4848 26.1877 2.2557 3.9096 8.6965 1.0150 5.4923 1.6322 1.3017 8.1766 3.8249 0.8279 0.1710 6.1413 0.4274 4.4234 0.2936 0.7362 1.2336 1.2990 1.3990 1.1501 0.4643 9.2481 5.5914 8.2927 4.9522 10.3357 9.6311 12.5576 3.7054 26.1984 37.9984 41.8636 52.0178 25.4130 43.8700 48.8773 74.8343 41.8287 36.8914 20.5601 61.5869
temp: 298.150 k
press: 1.00000 atm
elementType: 6 6 6 6 6 6 6 1 1 1 1 1 1 1 1 1 1 1 1
symmnumber: 1
zpe: 449154.2 jmol-1
zpe.correction: 0.171074 hartree
zpe.thermalcorrener: 0.178121 hartree
zpe.thermalcorrenthalpy: 0.179065 hartree
zpe.thermalcorrgfe: 0.140463 hartree
zpe.sumelectzpe: -273.364168 hartree
zpe.sumelectthermal: -273.357121 hartree
zpe.sumelectthermalent: -273.356176 hartree
zpe.sumelectthermalfe: -273.394779 hartree
dipole: 0.0170 -0.3047 0.0560
dipole: 0.3103
quadrupole: -42.7193 -43.7806 -45.5501
quadrupole: -0.3249 -0.8784 -0.1684
quadrupole: 1.2974 0.2361 -1.5335 -0.3249 -0.8784 -0.1684
hfenergy: -273.5352416 hartree
pointgroup: C01 [X(C7H12)]
dipole: 0.0046999 0.1199704 -0.0220069 debye
dipolederiv: 0.0553982 0.0553033 -0.0094847 -0.0085771 0.0314685 -0.0015437 0.0338017 0.0121665 0.2024879 0.0197942 -0.0256011 -0.0325845 -0.0327243 0.0762889 0.0063463 -0.0146957 0.001198 0.1010316 0.0373314 0.0143421 -0.0448101 0.0166355 0.0884191 -0.0220727 -0.0565898 -0.0046978 0.0939592 0.005981 -0.0308304 -0.0348136 -0.0017093 -0.0411419 -0.0105106 0.0149416 0.0010843 0.2114738 0.037307 -0.0568624 0.0715146 -0.1116384 0.1243877 0.0020773 0.1037849 -0.0303817 -0.2570449 0.0467474 0.0598166 0.0706085 0.122251 0.161264 -0.010589 0.0309125 -0.01494 -0.2406992 0.0180903 -0.0097916 0.0769872 0.0491884 0.0460105 0.0051595 0.0258791 0.0069216 0.0038092 -0.0518274 -0.0286093 -0.1038075 0.004258 0.0249214 -0.0367198 -0.1179587 -0.036711 -0.1308185 -0.0561957 0.1490909 -0.0236706 0.1299816 -0.1248199 0.0085936 -0.0032375 -0.0262487 0.0713855 -0.0056186 -0.0476368 0.1063274 -0.0298393 0.0620946 -0.0138216 0.0659424 0.0300089 -0.1656541 0.0231198 0.0454463 0.0918269 0.0233403 0.0680023 0.0282484 0.0647514 -0.0180678 -0.1589027 -0.0205976 -0.1252819 -0.0052611 -0.1191224 -0.1725794 -0.0032649 0.0043624 0.0209853 0.0792184 -0.0554025 0.0192067 -0.1223645 -0.0043034 0.0363944 0.0157914 -0.1809796 0.0003661 -0.0606992 -0.026112 -0.0170474 0.1000375 -0.0886261 0.0178127 0.0163347 0.1635264 0.0228966 -0.0739029 0.0123557 -0.0967173 -0.0262484 -0.0635359 -0.1596872 -0.0058437 -0.033763 0.0045422 0.1425635 -0.0050204 0.1018175 -0.0294962 0.0945873 -0.1459988 0.0113471 -0.0480398 0.0221638 0.1504392 -0.0887375 0.1212982 -0.0055 0.1847632 -0.0557259 0.0282749 -0.0189339 0.0427639 0.058243 0.0181192 -0.1017322 0.0432303 -0.1547525 -0.1077979 0.0466223 0.0211112 0.023397 0.0702511 0.0352675 -0.0262111 -0.1224911 -0.0101767 0.0706869 -0.0644296 -0.0548155 -0.0574473 -0.097141 unknown
polarizability: 86.4670746|0.5809271|69.5517856|2.4270618|-0.1813622|56.9691959 unknown
InChI: InChI=1S/C7H12/c1-7-5-3-2-4-6-7/h3,5,7H,2,4,6H2,1H3
charge 0 multiplicity 1
19 atoms
C  -1.127026 -0.100454 -0.4461
C  -0.294478 1.198868 -0.637824
C  0.871379 1.290506 0.375415
C  1.85044 0.107832 0.187925
C  -0.217057 -1.301596 -0.224338
C  1.113341 -1.212498 0.043813
C  -2.168519 0.028412 0.701191
H  -1.700248 -0.282436 -1.380782
H  -0.956719 2.082173 -0.548224
H  0.126239 1.211532 -1.663682
H  0.46766 1.269291 1.4068
H  1.406348 2.25241 0.259568
H  2.552231 0.051789 1.044417
H  2.483751 0.277908 -0.70948
H  -0.689497 -2.293283 -0.287485
H  1.701919 -2.132857 0.169577
H  -2.911463 0.814594 0.469041
H  -2.712486 -0.922223 0.854903
H  -1.675016 0.287832 1.655465
