program: Gaussian 09
title: 000137369
version: EM64L-G09RevD.01
frameworkgroup: C1[X(C13H14ClN3O5S2)]
method: RPBEPBE
basis: SDD
operation: Freq
keyword: #p
keyword: freq=noraman
keyword: PBEPBE/SDD
title: #p freq=noraman PBEPBE/SDD
converged: YES YES NO NO
title: Mulliken charges:
elementType: Cl S S O O O O O N N N C C C C C C C C C C C C C H H H H H H H H H H H H H H
charge: -0.049452 1.151771 0.220323 -0.564227 -0.204184 -0.495640 -0.498585 -0.179201 -0.071501 -0.404532 -0.257326 -0.203676 -0.379457 -0.341330 -0.360421 0.286426 0.676801 -0.079033 -0.428636 -0.779921 -0.319055 -0.240394 -0.078774 -0.241586 0.289670 0.243425 0.270309 0.253260 0.241627 0.280312 0.256337 0.277116 0.234040 0.256447 0.341918 0.384759 0.251039 0.261352
chargesum: 0.00000
title: Mulliken charges with hydrogens summed into heavy atoms:
elementType: Cl S S O O O O O N N N C C C C C C C C C C C C C
charge: -0.049452 1.151771 0.220323 -0.179469 -0.204184 -0.495640 -0.498585 -0.179201 -0.071501 -0.404532 -0.257326 0.085994 0.134277 0.153557 0.176228 0.286426 0.676801 -0.079033 -0.428636 -0.012318 0.022862 0.010645 -0.078774 0.019767
polarizability: 3.12766826e+02 6.09924893e+00 2.56662602e+02 3.76334054e+00 -6.22794851e+00 1.50437724e+02
1716.lowfreq: -0.0003 0.0013 0.0016 3.1653 7.5476 12.9744 21.4281 26.1075 35.7953
frequency: 21.3445 25.9844 35.7481 47.1537 58.4075 75.0817 91.5839 104.0569 107.7714 121.8844 128.9643 142.1076 147.0447 157.4804 179.9712 197.0857 216.2077 245.4823 264.4785 272.3930 278.4396 297.9485 302.3103 308.6640 322.1674 339.9228 353.6663 367.5757 388.1284 423.4562 440.2369 447.9609 454.3410 465.2179 481.1347 512.1320 543.3447 558.2404 571.2168 579.1013 621.8056 631.9055 679.9924 692.5906 722.4265 733.6052 763.6815 801.8014 803.4693 836.2903 850.6622 911.2148 929.5867 934.4725 942.6461 957.6424 969.9301 985.6507 998.6228 1018.4040 1025.8123 1034.9522 1050.5313 1066.8357 1069.1718 1083.0494 1111.0087 1137.0474 1158.5043 1172.0307 1194.1841 1217.5147 1256.3748 1257.7458 1277.3976 1290.2582 1324.1266 1333.8059 1349.6261 1354.0249 1371.1063 1372.8978 1386.3431 1424.6257 1437.1303 1448.7543 1448.8867 1458.5638 1460.3897 1468.5972 1582.9518 1594.7352 1632.5056 1660.7870 2957.6199 2969.0027 2977.9964 3013.3225 3048.8944 3059.0280 3067.2417 3077.8645 3092.2221 3129.9409 3158.0520 3159.0684 3181.9103 3484.0350
redmass: 6.9804 9.9276 5.1502 6.0635 7.0374 6.4619 10.2811 3.1663 5.7434 4.7209 9.0286 1.2205 2.7723 3.6829 5.9090 4.2205 5.4273 5.7154 3.1015 3.5684 3.3167 6.6523 5.8253 7.7626 8.7875 6.3835 7.8131 6.2448 3.5696 4.5807 7.9236 3.7733 8.5866 7.7652 3.9510 14.0545 6.8735 5.0955 5.4974 3.4433 8.1615 3.7448 7.3724 3.2506 5.1432 9.0388 6.0845 2.2777 1.3285 6.3428 5.5580 5.0963 1.9970 1.3690 1.3432 2.3412 2.0511 2.6003 2.2089 2.2948 2.2896 2.1470 4.9878 2.3906 2.2108 2.4932 4.0806 1.5385 2.5888 2.3237 3.2643 1.3113 1.3192 1.5214 1.5231 1.6767 2.6705 1.2481 1.3451 1.2847 1.3287 1.3126 7.7332 4.1708 1.0746 1.0902 2.6470 1.0746 1.0789 1.0939 8.9634 7.6445 7.3449 12.5490 1.0659 1.0656 1.0377 1.0583 1.0855 1.0955 1.0968 1.0973 1.1064 1.1001 1.0911 1.0927 1.0968 1.0664
irintensity: 0.8159 0.4663 2.9184 2.0040 1.9237 5.0830 7.6336 26.5554 10.5038 3.7891 1.0281 2.8865 9.2467 20.7899 8.5166 6.2932 10.2820 11.5948 8.0979 15.5406 15.4229 2.9959 5.0205 5.4299 26.2333 3.1637 23.4337 1.4073 3.0538 2.5190 4.6684 10.6083 12.5070 19.4779 0.6402 125.0750 57.2265 14.9683 4.5508 14.2369 12.0083 32.6820 2.2804 2.7706 0.1451 28.1068 11.7777 0.4954 41.9481 32.2721 71.2477 70.2775 1.1237 14.1042 16.3208 45.4413 38.8968 13.2123 9.1705 55.3165 58.5471 42.9545 9.3832 78.1645 12.3742 24.2320 24.7672 9.4477 40.4847 13.1990 21.2741 1.4845 3.4906 26.1214 15.8243 17.9552 18.8292 0.9669 2.5405 3.0812 34.9112 44.7188 3.6635 25.5157 17.5822 23.2668 88.4424 20.1544 7.4032 12.5472 31.6490 59.5947 80.5244 466.8913 22.9110 27.5215 1.7848 8.3807 3.0896 4.5219 6.6018 7.0652 3.5885 9.0088 6.3316 35.0431 3.3709 61.1699
temp: 298.150 k
press: 1.00000 atm
elementType: 17 16 16 8 8 8 8 8 7 7 7 6 6 6 6 6 6 6 6 6 6 6 6 6 1 1 1 1 1 1 1 1 1 1 1 1 1 1
symmnumber: 1
zpe: 692340.6 jmol-1
zpe.correction: 0.263699 hartree
zpe.thermalcorrener: 0.288200 hartree
zpe.thermalcorrenthalpy: 0.289144 hartree
zpe.thermalcorrgfe: 0.207810 hartree
zpe.sumelectzpe: -2298.345927 hartree
zpe.sumelectthermal: -2298.321426 hartree
zpe.sumelectthermalent: -2298.320482 hartree
zpe.sumelectthermalfe: -2298.401816 hartree
dipole: 1.2169 1.8308 0.5409
dipole: 2.2639
quadrupole: -161.8496 -182.2663 -154.8885
quadrupole: -13.0164 1.2846 2.8814
quadrupole: 4.4852 -15.9315 11.4463 -13.0164 1.2846 2.8814
hfenergy: -2298.6096257 hartree
pointgroup: C01 [X(C13H14Cl1N3O5S2)]
dipole: -0.4833018 0.7275871 -0.1742346 debye
polarizability: 312.5835202|-6.0216512|255.0214605|8.0333666|13.7990479|152.2621709 unknown
InChI: InChI=1S/C13H14ClN3O5S2/c1-8(18)11-7-15(4-5-16(11)24(20,21)22)17-10-6-9(14)2-3-12(10)23-13(17)19/h2-3,6,11,20H,4-5,7H2,1H3
charge 0 multiplicity 1
38 atoms
Cl -3.416309 3.620408 0.728606
S  4.422589 -0.082548 0.502347
S  -3.605615 -2.658173 -0.570661
O  4.325454 1.732384 1.024211
O  0.922379 2.073736 -0.09344
O  5.102398 -0.144148 -0.956624
O  4.99668 -0.91966 1.752475
O  -0.925128 -3.479431 -0.584801
N  -0.069445 -0.782308 0.053983
N  2.6654 -0.475891 0.295658
N  -1.403465 -1.199666 -0.129041
C  2.041278 0.050376 -0.948167
C  0.758989 -0.804315 -1.170998
C  0.609181 -1.328355 1.256313
C  1.849956 -0.451202 1.537361
C  1.751713 1.586455 -0.904436
C  -2.474174 -0.27804 -0.007949
C  -1.729559 -2.538784 -0.433217
C  -3.743129 -0.877245 -0.210265
C  2.542041 2.433718 -1.881158
C  -2.337005 1.095089 0.277906
C  -4.916276 -0.107475 -0.124695
C  -3.527953 1.840185 0.359039
C  -4.806968 1.273162 0.165989
H  2.741033 -0.159279 -1.776143
H  0.172869 -0.379257 -2.00417
H  1.076425 -1.834577 -1.438959
H  0.916492 -2.385522 1.114398
H  -0.082948 -1.259799 2.112449
H  1.5409 0.576594 1.800097
H  2.445175 -0.894875 2.353363
H  3.618966 2.365713 -1.63184
H  2.429797 2.054433 -2.914937
H  2.219461 3.484153 -1.827129
H  -1.344523 1.53576 0.415603
H  5.137976 1.930124 1.57471
H  -5.900774 -0.558859 -0.278878
H  -5.70218 1.89602 0.239196
