program: Gaussian 09
title: 000137367
version: EM64L-G09RevD.01
frameworkgroup: C1[X(C19H27Cl2NO)]
method: RPBEPBE
basis: SDD
operation: Freq
keyword: #p
keyword: freq=noraman
keyword: PBEPBE/SDD
title: #p freq=noraman PBEPBE/SDD
converged: YES YES NO NO
title: Mulliken charges:
elementType: Cl Cl O N C C C C C C C C C C C C C C C C C C C H H H H H H H H H H H H H H H H H H H H H H H H H H H
charge: -0.065914 -0.056750 -0.475085 -0.129231 0.357689 0.033170 -0.620318 -0.517649 0.323634 -0.401503 -0.445296 -0.445658 -0.211205 -0.460717 -0.762692 -0.791934 -0.768774 0.575314 -0.364109 -0.357571 -0.232371 -0.249751 -0.104175 0.200785 0.227471 0.205860 0.229893 0.206140 0.204482 0.218567 0.218625 0.198453 0.195249 0.224680 0.234102 0.202509 0.241428 0.216231 0.221096 0.218951 0.216470 0.219737 0.227108 0.205350 0.221150 0.245820 0.330357 0.306953 0.279286 0.254139
chargesum: 0.00000
title: Mulliken charges with hydrogens summed into heavy atoms:
elementType: Cl Cl O N C C C C C C C C C C C C C C C C C C C
charge: -0.065914 -0.056750 -0.144729 -0.129231 0.357689 0.233956 -0.186987 -0.081616 0.323634 0.021546 -0.028218 -0.025728 0.022898 -0.016780 -0.106413 -0.128619 -0.096454 0.575314 -0.364109 -0.050617 0.046915 0.004388 -0.104175
polarizability: 2.81047358e+02 7.08236840e+00 2.42427100e+02 -8.01354994e+00 4.79236607e+00 1.67480060e+02
1716.lowfreq: -15.2291 -0.0023 -0.0014 -0.0013 3.8787 7.1859 26.2498 32.4893 37.8619
frequency: 25.6211 31.9775 37.7544 66.1438 77.4973 107.1952 136.4217 141.7889 166.9000 172.1917 182.3274 202.9746 207.4356 241.4579 251.0385 267.9081 273.8381 279.6192 295.6792 301.1984 315.9922 327.3831 331.2198 355.4193 360.5683 367.5858 379.3838 388.9918 401.1561 414.9218 435.2233 467.8237 473.7609 478.2335 487.3757 508.0908 528.4917 563.6181 579.0354 594.6917 664.9543 706.2564 714.4711 726.2450 741.6651 784.4314 802.2649 826.9052 844.0442 861.5030 868.6661 877.5089 903.4127 920.4122 925.3888 926.9414 938.4246 945.6140 974.8320 998.3582 1003.7797 1008.9877 1011.6150 1022.2769 1026.4586 1048.4897 1056.1989 1080.6175 1088.5464 1096.1293 1112.1682 1115.7359 1123.2431 1131.8896 1148.8677 1174.4840 1187.9712 1199.2937 1210.0001 1224.9818 1226.0147 1235.5073 1249.1956 1259.4797 1274.0561 1279.5648 1287.5134 1293.1429 1310.2645 1330.0873 1333.5061 1344.2956 1349.2174 1350.4539 1356.2809 1364.1414 1373.1188 1376.1320 1377.8339 1379.9653 1398.7202 1401.8705 1436.7642 1443.9934 1453.7802 1458.2030 1459.8879 1465.6200 1466.1305 1472.0508 1474.4762 1478.7345 1489.6268 1493.9876 1500.9607 1561.1694 1590.1198 2825.2899 2839.8139 2897.1308 2969.6312 2973.9295 2975.4062 2979.4191 2981.0015 2984.9492 3004.4252 3004.8234 3016.0997 3022.3256 3038.1180 3048.1283 3052.0539 3062.7486 3065.1230 3065.7436 3072.2447 3076.0026 3078.7699 3086.8588 3106.4105 3168.6414 3182.8374 3556.6673
redmass: 5.0212 4.4058 4.9558 3.6513 4.5103 4.0801 6.4817 4.1461 5.8552 5.7549 3.2656 4.6760 1.0876 2.1228 1.3779 3.6573 1.8314 2.7828 2.2425 1.4103 1.9566 2.1669 2.0602 3.3343 2.3817 3.8161 1.8380 3.1988 3.1498 4.4016 3.5815 2.6096 2.7603 4.0646 2.5806 3.3958 2.8652 3.7869 2.6858 4.1410 6.2094 3.9278 3.5434 3.2489 4.1957 4.1335 2.7493 1.8619 1.4282 1.3990 2.5387 1.9582 2.8539 1.8303 1.6570 1.6988 1.7785 1.6592 2.1486 1.6313 1.5024 1.6737 2.4555 2.2397 1.6274 1.9407 2.3324 2.2505 1.4546 1.8767 2.5152 2.3640 2.4672 1.7012 2.2682 1.7333 1.4880 1.3934 1.8946 2.8303 2.0192 2.4315 1.2897 1.4528 1.3782 1.3073 1.4106 1.4604 1.4755 1.7574 1.5630 1.4324 1.4971 1.3727 1.6564 1.7284 1.3066 2.8358 1.3985 1.7093 1.3981 1.2062 1.0896 1.0930 2.3332 1.0799 1.0873 1.0864 1.0889 1.0529 1.0509 1.1140 1.0514 1.0545 1.0563 8.0107 7.1328 1.0795 1.0717 1.0683 1.0364 1.0639 1.0358 1.0487 1.0472 1.0594 1.0720 1.0806 1.0865 1.0827 1.0997 1.0986 1.1004 1.0993 1.0989 1.0993 1.0981 1.0988 1.1004 1.0998 1.0928 1.0939 1.0934 1.0654
irintensity: 0.3494 0.1252 0.5452 0.1454 1.8312 0.2152 0.4895 0.0926 0.0138 0.1491 0.2429 2.5898 4.5836 0.5306 0.2433 8.5774 4.7017 1.0233 9.0087 60.7437 1.5665 2.6801 37.2160 3.8285 11.5435 28.2090 31.8425 6.1458 0.8654 0.9637 6.1198 1.0066 3.7113 5.1270 1.3679 9.6134 5.2599 11.1457 3.5341 19.0224 7.1234 2.3440 1.6822 20.9655 23.3229 32.3053 3.3623 6.0789 29.9195 19.5507 9.3498 2.3622 14.4538 25.3734 0.1859 2.4806 7.1167 3.6843 3.1391 1.8935 9.5762 7.6891 8.3748 45.4124 1.4760 1.8360 36.7359 17.4285 7.5993 52.8365 5.5579 7.8554 17.5951 34.7167 6.3095 22.6149 6.0470 8.6819 12.4528 4.4156 0.8279 24.8272 4.4232 2.9366 6.1536 24.6218 9.0097 4.6932 8.1224 11.7019 10.8870 0.7607 0.9625 5.0472 21.6895 22.5538 21.8869 11.8637 10.1539 35.9558 0.2314 17.1221 4.7102 1.7854 102.0822 12.3977 11.7699 12.0173 11.2594 1.0062 5.7657 17.1232 10.5434 9.5337 32.2927 34.9445 26.2423 32.0504 110.7985 85.5014 24.2426 34.4748 21.5047 12.7903 12.4121 64.3411 30.6381 8.3224 22.9088 56.1162 16.3524 24.8031 62.1901 14.0808 15.1306 10.3702 110.2572 59.9187 20.4770 23.8155 42.1552 3.6180 0.3070 3.0759
temp: 298.150 k
press: 1.00000 atm
elementType: 17 17 8 7 6 6 6 6 6 6 6 6 6 6 6 6 6 6 6 6 6 6 6 1 1 1 1 1 1 1 1 1 1 1 1 1 1 1 1 1 1 1 1 1 1 1 1 1 1 1
symmnumber: 1
zpe: 1105232.4 jmol-1
zpe.correction: 0.420961 hartree
zpe.thermalcorrener: 0.444010 hartree
zpe.thermalcorrenthalpy: 0.444954 hartree
zpe.thermalcorrgfe: 0.369224 hartree
zpe.sumelectzpe: -1788.544244 hartree
zpe.sumelectthermal: -1788.521195 hartree
zpe.sumelectthermalent: -1788.520251 hartree
zpe.sumelectthermalfe: -1788.595981 hartree
dipole: -3.5473 -0.4249 -0.9364
dipole: 3.6933
quadrupole: -164.6914 -155.1321 -152.1951
quadrupole: -5.9418 6.6149 2.6749
quadrupole: -7.3519 2.2074 5.1444 -5.9418 6.6149 2.6749
hfenergy: -1788.9652049 hartree
pointgroup: C01 [X(C19H27Cl2N1O1)]
dipole: -1.3932736 0.1797718 0.3712653 debye
polarizability: 280.7877517|-7.916595|242.3676286|8.0457382|6.6174722|167.7991375 unknown
InChI: InChI=1S/C19H27Cl2NO/c1-18(2,3)19(23)8-9-22-12-13(4-6-15(22)11-19)16-7-5-14(20)10-17(16)21/h5,7,10,13,15,23H,4,6,8-9,11-12H2,1-3H3
charge 0 multiplicity 1
50 atoms
Cl 4.775987 2.207574 0.455946
Cl 5.417503 -3.276271 0.066516
O  -3.96777 1.335745 -0.275926
N  -0.529342 0.707863 -0.819874
C  -3.32957 0.002175 -0.067409
C  -1.070688 1.132366 0.505205
C  -2.1744 0.15043 0.956055
C  -2.724113 -0.33184 -1.450624
C  -4.442681 -1.034902 0.395874
C  -1.608691 0.651714 -1.843352
C  0.065574 1.185702 1.549125
C  0.568833 1.59655 -1.289674
C  1.752905 1.712323 -0.300881
C  1.203999 2.123149 1.101684
C  -3.828349 -2.417893 0.750833
C  -5.191269 -0.498581 1.651423
C  -5.491217 -1.223248 -0.73507
C  2.646389 0.475477 -0.222426
C  4.020371 0.568627 0.114534
C  2.15273 -0.836049 -0.468491
C  4.879721 -0.544056 0.20761
C  2.976719 -1.979302 -0.389718
C  4.331819 -1.81417 -0.049535
H  -1.517584 2.158759 0.414066
H  -1.701528 -0.836009 1.116563
H  -2.566627 0.49349 1.934482
H  -3.517387 -0.284963 -2.216621
H  -2.318528 -1.359922 -1.434928
H  -1.156847 0.3318 -2.801785
H  -2.059757 1.661441 -1.998841
H  0.458381 0.162231 1.707176
H  -0.349728 1.529916 2.516226
H  0.179823 2.633168 -1.469014
H  0.924067 1.209327 -2.263927
H  2.38508 2.546745 -0.661777
H  0.818462 3.160744 1.029267
H  2.023954 2.134426 1.842426
H  -4.640533 -3.143445 0.943932
H  -3.201409 -2.375008 1.659712
H  -3.213327 -2.822393 -0.073394
H  -5.781759 0.407794 1.419352
H  -4.506731 -0.274067 2.490474
H  -5.905328 -1.262058 2.010923
H  -6.366311 -1.77933 -0.349704
H  -5.081893 -1.798908 -1.584367
H  -5.83757 -0.243925 -1.110378
H  -4.230663 1.695345 0.609268
H  1.088371 -0.928804 -0.716992
H  5.933637 -0.421439 0.467639
H  2.570978 -2.975801 -0.585704
