program: Gaussian 09
title: 000011572
version: EM64L-G09RevD.01
frameworkgroup: C1[X(C7H12)]
method: RPBEPBE
basis: SDD
operation: Freq
keyword: #p
keyword: freq=noraman
keyword: PBEPBE/SDD
title: #p freq=noraman PBEPBE/SDD
converged: YES YES NO NO
title: Mulliken charges:
elementType: C C C C C C C H H H H H H H H H H H H
charge: -0.024252 -0.424277 -0.447888 -0.445890 -0.737977 -0.203939 -0.187835 0.210456 0.201847 0.198852 0.207958 0.202741 0.208362 0.209145 0.207149 0.214516 0.212100 0.198512 0.200418
chargesum: 0.00000
title: Mulliken charges with hydrogens summed into heavy atoms:
elementType: C C C C C C C
charge: 0.186204 -0.023577 -0.037189 -0.028383 -0.104212 -0.005427 0.012584
polarizability: 8.04314339e+01 4.95952161e+00 7.76525872e+01 1.02916465e+00 1.41784724e+00 5.43642870e+01
1716.lowfreq: -22.2736 -16.1621 -2.0021 -0.0004 -0.0003 -0.0003 133.6121 189.6049 214.2909
frequency: 133.6024 189.6011 214.2897 297.7491 378.5032 406.1607 436.5419 498.9017 657.7510 721.8482 782.2266 865.7258 882.8307 899.2602 937.9325 957.0871 976.4258 996.6294 1059.8111 1085.1619 1096.8312 1124.5101 1134.3765 1210.1134 1222.2343 1250.6550 1290.7185 1300.8101 1332.7063 1336.0381 1356.6467 1378.8733 1385.4927 1450.8992 1458.3949 1468.0468 1475.0515 1476.4368 1675.4161 2937.6248 2950.7709 2956.7088 2963.2548 2969.3213 2996.7639 3002.1010 3030.2861 3058.2478 3064.2251 3086.8672 3120.1506
redmass: 2.2035 1.7111 1.0953 2.3321 2.1943 1.9018 3.2106 4.1161 1.2494 2.4450 1.7819 2.1806 1.8781 2.0920 1.5902 1.7748 1.2219 1.6633 1.9330 1.6744 2.4682 1.4752 1.1506 1.2817 1.3232 1.2890 1.2930 1.3504 1.5288 1.5091 1.7265 1.5330 1.2395 1.0938 1.0784 1.0921 1.0475 1.0576 6.4061 1.0649 1.0627 1.0768 1.0390 1.0641 1.0956 1.0933 1.1025 1.0990 1.0992 1.0836 1.0993
irintensity: 0.3135 0.3640 0.0116 0.0857 0.3253 1.5713 0.1224 0.6193 47.3531 6.9731 2.1262 5.5349 6.8241 2.4255 2.6449 0.0951 0.0782 11.0880 4.0207 1.3566 0.1398 2.9604 4.2222 0.1590 0.5150 1.9405 1.3983 0.6697 1.4003 2.2176 4.7730 1.7591 10.4241 1.9078 15.3052 3.3442 13.7054 10.6310 5.4113 29.5788 39.8492 21.1803 23.4755 51.3836 39.9061 46.5007 51.5518 66.4632 46.7849 10.0148 67.6362
temp: 298.150 k
press: 1.00000 atm
elementType: 6 6 6 6 6 6 6 1 1 1 1 1 1 1 1 1 1 1 1
symmnumber: 1
zpe: 448232.4 jmol-1
zpe.correction: 0.170723 hartree
zpe.thermalcorrener: 0.177829 hartree
zpe.thermalcorrenthalpy: 0.178773 hartree
zpe.thermalcorrgfe: 0.140074 hartree
zpe.sumelectzpe: -273.365978 hartree
zpe.sumelectthermal: -273.358871 hartree
zpe.sumelectthermalent: -273.357927 hartree
zpe.sumelectthermalfe: -273.396626 hartree
dipole: 0.2437 -0.1924 -0.0693
dipole: 0.3182
quadrupole: -44.2532 -42.8147 -45.4517
quadrupole: 0.7119 -0.0706 0.2954
quadrupole: -0.0800 1.3585 -1.2785 0.7119 -0.0706 0.2954
hfenergy: -273.5367004 hartree
pointgroup: C01 [X(C7H12)]
dipole: -0.0986696 0.0720651 -0.0271886 debye
dipolederiv: 0.0824489 -0.0196247 -0.001238 -0.0360109 0.0591243 -0.0012828 0.0267033 -0.0065255 0.1501022 -0.0043852 -0.0628389 0.0129742 -0.0482113 0.0468506 -0.0440044 -0.0005162 -0.0225206 0.1372882 -0.0967218 0.0473596 -0.0002201 0.0037959 0.019887 0.0281824 0.0368962 0.0458592 0.210215 -0.0042604 0.0215103 0.0176793 0.0354028 -0.0128156 0.0087548 0.0094188 0.0559352 0.2124271 -0.0784493 -0.0029414 0.0223757 0.0048273 0.0718132 -0.002526 -0.0019125 -0.0013949 0.1008775 0.2173455 0.0149256 -0.0258938 0.0030273 -0.0013585 -0.0169937 -0.0502455 -0.0299699 -0.2424897 0.0389707 -0.097693 -0.001221 -0.0731428 0.1573975 -0.0301627 0.0017449 -0.0538612 -0.253889 0.0262569 -0.0057908 0.0535617 0.0025245 0.0227887 0.0242254 0.016592 0.0141122 -0.1921987 0.0354184 -0.0154121 0.0238505 -0.0278328 0.0665574 0.0550572 0.0289063 -0.0153386 -0.1799923 -0.0187322 0.1357479 -0.0186645 0.1163949 -0.1525546 0.0264666 -0.031584 0.0528437 0.0633072 0.0051473 -0.0847528 -0.0417613 -0.0452583 -0.0989468 -0.0956615 -0.0729053 -0.1337158 0.0129946 -0.0155052 -0.0625262 0.0796617 0.0116266 0.0713845 0.0295109 0.0809094 0.0931235 -0.1336217 -0.03829 -0.0724573 -0.0705515 -0.0949305 -0.0725139 -0.0787303 -0.0842169 -0.1343487 0.0150809 0.0626224 0.0590601 0.0084046 -0.0039497 -0.0095197 0.0774576 0.0567422 0.1225591 -0.1374931 0.062129 0.0044209 -0.0146127 -0.0022312 0.0851919 0.0122585 0.0726327 0.0102655 -0.1762746 -0.0119936 0.0771715 -0.0236476 0.1543995 -0.0965553 0.0784763 -0.0423338 0.0738552 0.059135 -0.005901 -0.0787126 -0.0320945 -0.1479236 -0.0863401 -0.0895567 -0.054876 -0.0871458 0.0448475 -0.0570409 0.1087192 -0.0079646 0.1247746 -0.1113441 0.0177959 -0.0075753 0.0148326 0.1542633 -0.1990594 0.0338348 0.0193618 0.0227178 0.0409535 0.0007324 0.0156196 0.0014349 0.1554206 unknown
polarizability: 80.0636175|5.0307486|77.9894196|-1.1486155|-1.6301513|54.395271 unknown
InChI: InChI=1S/C7H12/c1-7-5-3-2-4-6-7/h2-3,7H,4-6H2,1H3
charge 0 multiplicity 1
19 atoms
C  -1.02373 0.019527 -0.328286
C  -0.302947 1.230307 0.315863
C  -0.336893 -1.297079 0.119776
C  1.179803 1.308852 -0.120534
C  -2.531202 0.007371 0.001596
C  1.179371 -1.217125 0.064828
C  1.860878 -0.04744 -0.059361
H  -0.902927 0.104439 -1.429643
H  -0.356727 1.128323 1.419539
H  -0.827671 2.169946 0.052795
H  -0.689788 -2.137811 -0.512402
H  -0.659506 -1.546592 1.15516
H  1.727723 2.029661 0.519828
H  1.251079 1.711563 -1.153882
H  -2.690301 -0.033993 1.096859
H  -3.033715 0.916517 -0.378724
H  -3.03504 -0.870892 -0.445156
H  1.73525 -2.163749 0.126292
H  2.958743 -0.062925 -0.116749
