program: Gaussian 09
title: 000137307
version: EM64L-G09RevD.01
frameworkgroup: C1[X(C18H12N2O4S)]
method: RPBEPBE
basis: SDD
operation: Freq
keyword: #p
keyword: freq=noraman
keyword: PBEPBE/SDD
title: #p freq=noraman PBEPBE/SDD
converged: YES YES NO NO
title: Mulliken charges:
elementType: S O O O O N N C C C C C C C C C C C C C C C C C C H H H H H H H H H H H H
charge: 0.304055 -0.279243 -0.217531 -0.409837 -0.208832 -0.248882 -0.042962 0.626780 -0.228027 0.089670 -0.349140 -0.341016 0.388061 -0.344820 -0.291381 -0.460883 -0.205232 -0.425302 -0.241315 0.366871 -0.197063 -0.416545 0.253429 -0.575040 0.212966 0.273742 0.251301 0.249783 0.284558 0.234903 0.282813 0.236815 0.231525 0.257727 0.277970 0.276274 0.383809
chargesum: 0.00000
title: Mulliken charges with hydrogens summed into heavy atoms:
elementType: S O O O O N N C C C C C C C C C C C C C C C C C C
charge: 0.304055 -0.279243 -0.217531 -0.026029 -0.208832 -0.248882 -0.042962 0.626780 -0.228027 0.089670 -0.349140 -0.067274 0.388061 -0.093519 -0.041597 -0.176324 0.029671 -0.142489 -0.004499 0.366871 0.034462 -0.158819 0.253429 -0.020796 0.212966
polarizability: 3.94849363e+02 -4.36367991e+01 2.71150092e+02 1.20237354e+01 1.34558309e+01 1.08325368e+02
1716.lowfreq: -5.3241 -3.5605 -2.0737 0.0012 0.0014 0.0018 4.8181 19.3801 22.6459
frequency: 3.7384 19.1947 22.6383 39.2423 44.6823 48.6425 69.4331 116.6200 126.1207 141.4916 162.0348 208.0809 218.5984 221.9990 261.3131 267.1235 298.0715 329.1584 331.7141 372.9483 401.7453 428.9114 447.5770 454.2917 475.6438 484.8236 515.3381 525.7505 530.8442 533.2161 574.0738 579.3233 626.1486 641.4963 644.2415 655.3713 674.8323 684.2568 695.6643 709.9106 720.9572 731.7441 752.1548 756.9352 800.2391 813.8862 856.3828 869.1663 904.2579 913.0687 927.1376 935.0864 939.3217 950.9005 967.7655 981.0789 986.5150 995.9322 1018.7983 1045.3734 1052.3526 1061.8828 1086.6523 1109.5186 1132.8715 1135.8353 1150.1712 1172.8495 1175.2650 1200.6087 1226.4226 1239.4214 1252.5211 1278.4189 1297.1171 1307.1190 1336.3239 1379.8102 1384.8368 1399.1318 1424.9591 1431.6047 1444.7586 1452.7480 1458.3058 1484.3797 1546.0161 1587.7928 1591.6755 1604.6273 1611.5756 1648.5189 1678.4776 3037.9356 3103.9185 3141.8275 3143.8552 3151.9317 3163.1361 3169.7978 3176.4460 3179.0368 3205.4577 3251.6723 3514.3921
redmass: 6.7076 7.7926 9.4722 8.6034 5.9005 5.7547 8.5925 5.9436 6.7761 6.5676 4.5526 8.0541 6.3105 5.1625 4.9958 6.0417 4.5585 6.7578 7.2775 7.2607 6.4040 3.1238 3.2154 6.1563 2.7182 7.2534 9.6960 4.3945 4.2331 4.1278 4.8641 5.6437 5.1708 1.4503 3.1072 6.5269 6.8039 3.5301 1.9932 6.6002 3.4108 8.4637 2.2518 1.3723 7.1494 1.5334 1.3611 4.7025 7.4138 1.5366 1.3932 5.2267 1.3818 2.8858 6.7817 1.3226 6.0903 1.3508 3.0289 2.7474 2.4418 2.0862 1.5705 2.4450 1.9732 1.9801 2.7803 1.1209 1.1172 2.8296 1.6945 2.9645 1.6733 1.9976 1.7270 1.6881 2.0709 8.0006 9.0579 2.9277 1.0973 3.5284 3.0138 4.2164 2.9046 4.9603 6.3774 6.8779 6.6115 7.1916 6.5830 10.7536 8.7958 1.0595 1.1015 1.0857 1.0877 1.0900 1.0955 1.0924 1.1008 1.0986 1.0923 1.0996 1.0641
irintensity: 0.5735 0.0672 1.9690 2.3287 1.1917 0.0826 0.3613 0.6468 0.3140 0.6841 0.6394 1.7932 0.3149 5.1704 2.7123 0.4036 2.7269 1.0681 2.9445 2.1307 2.2712 10.3077 2.4848 2.7350 8.4020 2.5121 8.8689 13.3782 58.3488 11.1842 1.7942 8.2973 19.3228 130.7881 3.4931 0.1312 6.9884 13.4231 2.1223 0.4950 4.2841 17.2687 27.0501 139.7844 16.8468 32.4294 0.7691 11.9435 29.4654 30.1685 0.0419 92.8006 2.9860 18.9600 5.4898 0.0529 2.0463 2.1578 20.0566 5.6688 353.7721 7.8699 19.6547 0.5885 107.5477 51.2324 142.2928 3.4521 8.4594 53.3543 250.0289 46.2326 20.0421 2.5609 8.3179 28.7176 140.5992 20.7608 8.9184 8.3196 51.5305 88.0439 56.9431 103.8554 19.4719 247.7249 22.6441 1.0621 37.5191 38.6922 73.5218 187.3695 206.1736 1.3634 1.4089 0.7607 15.0459 5.9830 12.3147 1.2673 17.5723 9.6452 3.5978 2.8346 31.1864
temp: 298.150 k
press: 1.00000 atm
elementType: 16 8 8 8 8 7 7 6 6 6 6 6 6 6 6 6 6 6 6 6 6 6 6 6 6 1 1 1 1 1 1 1 1 1 1 1 1
symmnumber: 1
zpe: 688074.0 jmol-1
zpe.correction: 0.262074 hartree
zpe.thermalcorrener: 0.283069 hartree
zpe.thermalcorrenthalpy: 0.284014 hartree
zpe.thermalcorrgfe: 0.206594 hartree
zpe.sumelectzpe: -1499.858592 hartree
zpe.sumelectthermal: -1499.837596 hartree
zpe.sumelectthermalent: -1499.836652 hartree
zpe.sumelectthermalfe: -1499.914072 hartree
dipole: 0.0443 -2.7888 -0.9741
dipole: 2.9544
quadrupole: -101.4009 -140.9878 -157.9021
quadrupole: -11.3487 1.9430 1.2951
quadrupole: 32.0294 -7.5575 -24.4718 -11.3487 1.9430 1.2951
hfenergy: -1500.1206658 hartree
pointgroup: C01 [X(C18H12N2O4S1)]
dipole: -0.0052242 1.0551245 -0.4875544 debye
polarizability: 395.8237836|-41.8623034|266.1804427|5.9054822|-30.8489082|112.320596 unknown
InChI: InChI=1S/C18H12N2O4S/c21-16(22)9-17(23)24-12-5-3-4-11(8-12)13-10-20-14-6-1-2-7-15(14)25-18(20)19-13/h1-8,10,21H,9H2
charge 0 multiplicity 1
37 atoms
S  -4.923295 -1.543537 0.315485
O  3.99861 -0.362052 -0.157785
O  3.033532 1.720007 -0.706931
O  7.474825 1.72633 0.757306
O  5.490635 1.55551 1.959133
N  -2.851433 0.110733 -0.050334
N  -2.056348 -1.994804 0.328551
C  -3.965978 0.962179 -0.181259
C  -3.144611 -1.241496 0.213155
C  -0.973404 -1.090285 0.129662
C  -5.188376 0.245525 -0.014894
C  -1.455165 0.2099 -0.104745
C  0.418828 -1.56139 0.186257
C  -3.973006 2.34738 -0.440256
C  -6.426211 0.903032 -0.106175
C  1.497444 -0.660484 -0.03277
C  -5.218159 3.006697 -0.531278
C  0.686275 -2.928049 0.462875
C  -6.432576 2.294448 -0.366567
C  2.815309 -1.151907 0.034621
C  2.01717 -3.39162 0.524354
C  3.095706 -2.508155 0.311446
C  4.024234 0.996625 -0.479409
C  5.474459 1.455691 -0.525121
C  6.087238 1.567504 0.865947
H  -0.942759 1.147896 -0.2930
H  -3.035131 2.897122 -0.566797
H  -7.36567 0.356612 0.020627
H  1.318771 0.392166 -0.252238
H  -5.242754 4.082642 -0.731734
H  -0.160012 -3.601046 0.626195
H  -7.388457 2.822683 -0.44058
H  2.218943 -4.445824 0.740904
H  4.136194 -2.84145 0.358904
H  6.085367 0.759353 -1.123651
H  5.516737 2.449058 -1.00352
H  7.86737 1.832107 1.666421
