program: Gaussian 09
title: 000137292
version: EM64L-G09RevD.01
frameworkgroup: C1[X(C15H11NO)]
method: RPBEPBE
basis: SDD
operation: Freq
keyword: #p
keyword: freq=noraman
keyword: PBEPBE/SDD
title: #p freq=noraman PBEPBE/SDD
converged: NO YES NO NO
title: Mulliken charges:
elementType: O N C C C C C C C C C C C C C C C H H H H H H H H H H H
charge: -0.225573 -0.071728 0.252965 0.108060 0.294705 0.331004 -0.469746 -0.359360 -0.348245 -0.361056 -0.355028 -0.238846 -0.230012 -0.247920 -0.232356 -0.234931 -0.235487 0.247162 0.226577 0.269666 0.220028 0.271787 0.231185 0.232854 0.228238 0.230736 0.233694 0.231629
chargesum: 0.00000
title: Mulliken charges with hydrogens summed into heavy atoms:
elementType: O N C C C C C C C C C C C C C C C
charge: -0.225573 -0.071728 0.252965 0.108060 0.294705 0.331004 -0.222584 -0.132783 -0.078580 -0.141029 -0.083241 -0.007661 0.002842 -0.019682 -0.001620 -0.001238 -0.003858
polarizability: 3.19895376e+02 3.55310920e-01 1.66789041e+02 -9.31330220e-02 -4.25287432e-02 6.58074688e+01
1716.lowfreq: -1.9986 -0.0006 -0.0005 0.0005 4.6034 12.4402 22.5813 32.2924 69.5501
frequency: 22.0340 32.2771 69.5368 70.0387 124.0709 173.8730 230.9180 236.8770 327.2241 380.3463 399.8836 400.2381 403.4631 481.7323 495.2330 495.7973 614.0600 615.7695 639.6456 660.4299 679.2601 691.7736 695.8037 698.1225 774.3674 779.5776 833.9264 847.8888 852.1037 855.9616 917.9899 929.1028 931.0779 933.2154 982.7770 983.8171 988.6681 989.9170 1001.5097 1002.5984 1003.7469 1025.6115 1031.9857 1069.7804 1085.3747 1091.3704 1174.9504 1175.7345 1192.8403 1194.2812 1222.8300 1244.1239 1306.4774 1326.9808 1361.4991 1381.9749 1389.6540 1418.8202 1440.6133 1449.8385 1476.6657 1512.1288 1573.8444 1587.2237 1595.5837 1617.7919 1619.8379 3127.6736 3130.1286 3135.8675 3138.2634 3147.9633 3150.3420 3159.2878 3162.3127 3170.3107 3173.3446 3246.1255
redmass: 3.9818 4.7963 5.1364 4.7413 5.1727 4.9455 4.3651 6.4292 6.0444 5.9212 2.7972 2.7974 8.6875 3.5018 5.2306 4.1401 6.4624 6.4551 5.8681 6.7704 2.0548 6.2247 1.8197 2.2692 1.6826 1.7967 1.7430 13.4110 1.2564 1.2689 9.8135 7.9414 1.4282 1.4465 1.3849 1.3814 6.2123 6.2266 4.1656 1.3297 1.3309 2.4693 1.9058 1.8999 1.6367 2.0095 1.0571 1.0561 1.1429 1.1181 1.7332 4.5492 1.7762 1.3500 2.5755 7.7806 9.1550 3.0054 2.3450 2.5988 2.3038 3.5067 6.3850 6.2036 6.7626 6.0346 6.1722 1.0848 1.0851 1.0881 1.0883 1.0931 1.0934 1.0964 1.0966 1.1011 1.1006 1.0983
irintensity: 0.8881 1.8537 0.5507 0.9792 0.0080 2.3805 0.4377 0.2540 0.0366 1.8864 0.0240 0.0103 0.3503 11.0493 4.4932 1.4325 0.0090 0.0223 0.1669 1.0416 47.7053 21.6070 2.5436 48.4402 98.1649 55.4176 16.7977 17.3384 0.0231 1.7335 5.7857 6.8599 0.9448 7.8095 0.0602 0.2185 0.1795 0.2809 5.2662 0.2129 0.4402 8.6642 7.7476 0.3922 16.4326 3.3522 0.0346 0.0025 9.5864 0.0430 2.3199 1.8092 3.8822 1.1436 13.0048 0.3168 5.2879 48.2661 15.7508 47.6105 65.3184 4.5624 62.0208 1.6540 19.6407 0.8103 3.2563 3.1006 2.6196 4.1476 2.7049 31.1667 26.0500 19.7867 21.4708 19.9466 15.6378 1.4412
temp: 298.150 k
press: 1.00000 atm
elementType: 8 7 6 6 6 6 6 6 6 6 6 6 6 6 6 6 6 1 1 1 1 1 1 1 1 1 1 1
symmnumber: 1
zpe: 565571.0 jmol-1
zpe.correction: 0.215415 hartree
zpe.thermalcorrener: 0.228517 hartree
zpe.thermalcorrenthalpy: 0.229461 hartree
zpe.thermalcorrgfe: 0.173449 hartree
zpe.sumelectzpe: -706.980619 hartree
zpe.sumelectthermal: -706.967517 hartree
zpe.sumelectthermalent: -706.966573 hartree
zpe.sumelectthermalfe: -707.022585 hartree
dipole: -0.7688 3.2444 0.0078
dipole: 3.3343
quadrupole: -72.9084 -91.5882 -105.8130
quadrupole: 0.6480 -0.0244 -0.0256
quadrupole: 17.1948 -1.4850 -15.7098 0.6480 -0.0244 -0.0256
hfenergy: -707.1960339 hartree
pointgroup: C01 [X(C15H11N1O1)]
dipole: 0.3020147 -1.2746251 -0.070291 debye
polarizability: 319.8916201|0.3558894|166.4627168|-0.9934215|5.7290893|66.1375487 unknown
InChI: InChI=1S/C15H11NO/c1-3-7-12(8-4-1)14-11-15(17-16-14)13-9-5-2-6-10-13/h1-11H
charge 0 multiplicity 1
28 atoms
O  0.730144 1.617325 0.125801
N  -0.730902 1.678145 0.134724
C  1.129034 0.271743 0.048437
C  -1.13208 0.376172 0.063884
C  2.567706 -0.001792 0.027523
C  -2.57254 0.04615 0.052665
C  -0.007758 -0.523913 0.008079
C  3.043191 -1.339536 -0.059172
C  3.506968 1.064415 0.094116
C  -3.006894 -1.303982 -0.013225
C  -3.547557 1.080465 0.108903
C  4.427103 -1.604063 -0.078943
C  4.890387 0.793708 0.074046
C  -4.383598 -1.615083 -0.02288
C  -4.921034 0.767244 0.099279
C  5.357155 -0.539149 -0.012521
C  -5.346506 -0.581699 0.03325
H  -0.03996 -1.607909 -0.050892
H  2.332293 -2.17157 -0.111423
H  3.143969 2.094528 0.161445
H  -2.274954 -2.117889 -0.056672
H  -3.21349 2.12159 0.160419
H  4.781339 -2.638333 -0.146325
H  5.605108 1.622025 0.126078
H  -4.703868 -2.661475 -0.074009
H  -5.661742 1.573156 0.143085
H  6.432655 -0.746449 -0.028114
H  -6.415067 -0.823223 0.025642
