program: Gaussian 09
title: 000137277
version: EM64L-G09RevD.01
frameworkgroup: C1[X(C3ClN)]
method: RPBEPBE
basis: SDD
operation: Freq
keyword: #pfreq=noraman
keyword: PBEPBE/SDD
title: #p freq=noraman PBEPBE/SDD
converged: NO NO NO NO
title: Mulliken charges:
elementType: Cl N C C C
charge: 0.157197 -0.019574 0.281012 -0.304783 -0.113851
chargesum: 0.00000
title: Mulliken charges with hydrogens summed into heavy atoms:
polarizability: 1.02862483e+02 -3.02073001e-02 1.65891367e+01 -1.38507703e-02 -2.11056268e-04 1.65872196e+01
1716.lowfreq: -0.0024 -0.0022 0.0009 17.2628 17.2723 140.3268 140.3311 320.8297 320.8323
frequency: 140.3218 313.4399 320.8256 497.3748 522.0185 522.6728 1060.9104 2106.0623 2294.9917
redmass: 13.7756 12.4908 12.3224 19.3786 12.1268 12.1493 12.9718 12.5253 12.1003
irintensity: 0.8691 2.8828 3.6463 7.7122 0.1651 0.2284 18.5776 1.0853 198.7303
temp: 298.150 k
press: 1.00000 atm
elementType: 17 7 6 6 6
symmnumber: 1
zpe: 46526.5 jmol-1
zpe.correction: 0.017721 hartree
zpe.thermalcorrener: 0.022684 hartree
zpe.thermalcorrenthalpy: 0.023628 hartree
zpe.thermalcorrgfe: -0.006865 hartree
zpe.sumelectzpe: -628.686252 hartree
zpe.sumelectthermal: -628.681289 hartree
zpe.sumelectthermalent: -628.680345 hartree
zpe.sumelectthermalfe: -628.710838 hartree
dipole: -3.8522 0.0101 -0.0022
dipole: 3.8522
quadrupole: -42.8987 -34.0239 -34.0238
quadrupole: 0.0599 -0.0008 0.0000
quadrupole: -5.9166 2.9582 2.9584 0.0599 -0.0008 0.0000
hfenergy: -628.7039733 hartree
pointgroup: C01 [X(C3Cl1N1)]
dipole: -1.5155687 0.0032105 -0.0005598 debye
dipolederiv: -0.6896187 -0.0021055 -0.0006642 -0.0034086 0.152737 -0.0000043 -0.0028529 -0.0000049 0.1527452 -0.3996477 -0.0033131 0.0002754 -0.0003819 -0.2291013 -0.000002 0.0002795 0.0000008 -0.2291339 -0.7767467 -0.0019176 -0.0007205 -0.0056065 0.0929599 -0.0000061 -0.0009586 0.0000042 0.0929895 1.1963156 0.0051314 0.0013416 0.0068262 -0.0994042 0.0000102 0.0041812 0.0000014 -0.0994339 0.6696975 0.0022048 -0.0002323 0.0025708 0.0828086 0.0000022 -0.0006493 -0.0000015 0.0828331 unknown
polarizability: 102.8624909|0.0200964|16.5891524|-0.0019565|0.0000691|16.5871958 unknown
InChI: InChI=1S/C3ClN/c4-2-1-3-5
charge 0 multiplicity 1
5 atoms
Cl -2.889863 -0.005749 -0.001604
N  2.620636 -0.007766 -0.000579
C  0.043612 0.007917 0.000719
C  -1.192157 0.002205 0.001995
C  1.417673 0.003393 -0.00063
