program: Gaussian 09
title: 000137265
version: EM64L-G09RevD.01
frameworkgroup: C1[X(C9H5Cl3F3NO)]
method: RPBEPBE
basis: SDD
operation: Freq
keyword: #p
keyword: freq=noraman
keyword: PBEPBE/SDD
title: #p freq=noraman PBEPBE/SDD
converged: YES YES NO NO
title: Mulliken charges:
elementType: Cl Cl Cl F F F O N C C C C C C C C C H H H H H
charge: 0.069303 0.120523 0.166719 -0.161750 -0.161820 -0.167246 -0.191080 -0.432018 0.534133 0.348683 -0.588839 -0.340348 -0.347714 -0.195244 0.259078 0.421052 -0.752463 0.264554 0.313299 0.266808 0.330744 0.243628
chargesum: 0.00000
title: Mulliken charges with hydrogens summed into heavy atoms:
elementType: Cl Cl Cl F F F O N C C C C C C C C C
charge: 0.069303 0.120523 0.166719 -0.161750 -0.161820 -0.167246 -0.191080 -0.101274 0.534133 0.348683 -0.324285 -0.027049 -0.080907 0.048384 0.259078 0.421052 -0.752463
polarizability: 2.05729840e+02 -1.81780757e-01 1.40065240e+02 -2.83638473e+00 8.95634243e-01 8.84632153e+01
1716.lowfreq: -2.9296 -0.0010 0.0013 0.0017 1.6850 8.0455 15.2501 19.7206 43.0326
frequency: 14.3446 19.4846 43.0157 63.9751 69.4330 130.2552 146.9926 162.5628 181.7222 206.5485 243.7070 262.2108 280.6222 286.3098 308.9684 345.0452 345.9367 377.2056 402.6018 427.3111 487.4465 520.5129 553.4699 604.2206 609.5786 621.2920 682.8192 698.1026 713.6659 729.6370 761.4200 777.4945 815.5981 871.7642 905.1787 936.3340 945.3049 985.2375 991.7061 1004.9352 1017.7835 1056.5724 1110.1349 1165.7486 1192.7016 1237.6634 1303.3264 1321.5598 1390.9781 1429.2507 1484.0795 1534.1200 1603.3028 1626.3916 1636.5362 3148.4980 3154.2485 3175.3630 3199.8611 3477.7961
redmass: 19.4153 17.2411 9.7382 6.4675 15.0507 7.2273 15.8923 11.5598 13.0448 13.1480 9.0524 12.2717 11.0342 8.7687 6.8545 16.1795 10.3975 18.7991 8.1055 5.0983 4.8657 10.9680 8.3476 10.0222 11.2413 4.2873 8.8927 2.0274 1.7112 4.1018 10.8825 10.5952 1.4320 6.3913 1.5648 1.3909 10.1997 6.1909 10.9880 1.3405 6.3107 3.9335 1.6936 3.2739 1.0911 1.9294 3.2389 1.5535 6.0909 3.1202 2.7823 1.9058 4.9450 6.3081 8.7513 1.0922 1.0884 1.0964 1.0958 1.0768
irintensity: 0.1081 0.0893 2.2784 3.4276 1.3995 0.3983 1.3946 2.7772 3.5727 1.3001 0.9315 5.1898 1.5989 0.5228 0.3245 0.9381 2.7822 10.9386 7.2652 0.4826 11.3853 7.5447 62.3730 82.4789 12.2668 0.4776 10.3848 13.6859 78.4265 113.7929 47.7347 46.5141 62.2493 82.2734 73.0762 1.6528 62.7271 8.9074 211.4638 4.6331 147.2924 132.0302 0.1907 21.4134 0.6098 103.3670 192.2102 79.1301 27.2908 2.3235 133.2947 323.6172 2.6305 47.6469 171.4415 3.0445 5.2221 3.6730 4.8545 56.8244
temp: 298.150 k
press: 1.00000 atm
elementType: 17 17 17 9 9 9 8 7 6 6 6 6 6 6 6 6 6 1 1 1 1 1
symmnumber: 1
zpe: 333757.4 jmol-1
zpe.correction: 0.127121 hartree
zpe.thermalcorrener: 0.143512 hartree
zpe.thermalcorrenthalpy: 0.144456 hartree
zpe.thermalcorrgfe: 0.079328 hartree
zpe.sumelectzpe: -2154.407405 hartree
zpe.sumelectthermal: -2154.391015 hartree
zpe.sumelectthermalent: -2154.390071 hartree
zpe.sumelectthermalfe: -2154.455199 hartree
dipole: 0.2140 0.4181 -0.0335
dipole: 0.4709
quadrupole: -135.6562 -114.2929 -119.7614
quadrupole: -13.1099 -0.7470 0.2802
quadrupole: -12.4193 8.9439 3.4754 -13.1099 -0.7470 0.2802
hfenergy: -2154.5345269 hartree
pointgroup: C01 [X(C9H5Cl3F3N1O1)]
dipole: 0.0925043 0.1604064 -0.0063783 debye
dipolederiv: -0.322007 -0.1088472 -0.0757806 0.0203936 -0.7054881 -0.2774507 -0.0216784 -0.2649962 -0.2874183 -0.2908473 0.0592707 -0.0858664 0.0958755 -0.1540351 0.1122103 -0.1964635 0.1169585 -0.7659777 -0.5797506 -0.1710278 0.2407033 -0.192694 -0.159534 0.1041091 0.2231996 0.104608 -0.2259074 -0.80114 -0.0243688 0.2655417 -0.0279145 -0.3318896 -0.0837772 0.2457969 -0.080351 -0.5243425 -0.667724 -0.1330226 -0.2523587 -0.1504458 -0.3344346 -0.0123782 -0.3111226 -0.0398923 -0.7188946 -0.4398355 -0.0183577 -0.0231424 -0.0490783 -0.8006841 0.0981826 -0.0358162 0.0692898 -0.3034989 -0.7333583 0.1244524 -0.0119914 -0.5429817 -0.7355367 0.0179322 -0.0672136 0.0188167 -0.2739396 -1.7466578 0.1437947 -0.0458593 0.0840821 -0.3929632 -0.0141607 -0.0011467 0.0136178 -0.2653897 1.0155154 -0.3109363 0.0084649 -0.5331263 0.1036 -0.0145488 -0.0126322 -0.0052695 0.1192005 -0.2586011 -0.190729 -0.0045777 -0.1659598 -0.1090328 0.0041817 0.0518258 0.0300891 -0.1379246 -0.19082 0.1750663 0.0014377 -0.0799217 -0.0162161 0.002038 -0.0082391 -0.006294 -0.1485217 -0.1568809 0.0340122 -0.0054513 0.1719471 -0.0983046 0.0045775 -0.0026398 0.0022195 -0.1340471 -0.0724401 -0.0794669 -0.007893 0.0739283 -0.0855108 0.0003097 -0.0153932 -0.0018513 -0.1207916 -0.0583425 0.0283095 -0.0004069 -0.0893967 0.2125802 0.0087479 -0.0035358 0.0087272 -0.1228314 2.043882 0.3094001 0.0136891 0.4436503 1.50591 0.0013688 0.0765585 0.0348671 1.5430178 1.615444 -0.1853415 0.0896093 0.6781692 0.7904088 -0.0366613 0.2298008 -0.0935571 0.0591614 1.0530827 0.3746236 -0.100443 0.2839909 0.9698031 0.0978397 -0.114376 0.1031853 1.3708145 0.1132861 0.0556984 0.0025383 0.0587033 -0.0079938 -0.0042733 -0.0008419 -0.0034791 0.1654034 0.1234901 -0.0676773 0.0002903 -0.0511798 0.123284 -0.0030951 -0.0009968 -0.0014431 0.1779832 -0.0100765 0.0484283 0.000142 0.0385312 0.0960486 -0.0015713 0.0041118 -0.0022516 0.1648645 0.2914045 -0.0759865 -0.0091379 -0.0963071 0.2055082 0.002255 -0.0425566 0.003159 0.2753919 0.0723767 0.0127054 0.0004921 0.0297347 -0.0755194 -0.0058359 0.0033588 -0.0061532 0.1536479 unknown
polarizability: 205.6106603|-3.4300605|140.1698087|1.1425261|2.0920553|88.4778255 unknown
InChI: InChI=1S/C9H5Cl3F3NO/c10-8(11,12)7(17)16-6-3-1-2-5(4-6)9(13,14)15/h1-4,16H
charge 0 multiplicity 1
22 atoms
Cl 3.40354 -2.300815 -0.684821
Cl 4.065716 -0.924178 1.946885
Cl 5.276143 0.075672 -0.645072
F  -4.575676 -0.375811 0.825279
F  -4.217985 -0.714702 -1.381693
F  -3.279455 -2.111139 0.138363
O  2.796979 1.615944 0.009652
N  1.331751 -0.22536 -0.032248
C  0.059449 0.415092 -0.028554
C  -2.368239 0.137506 -0.047991
C  -1.079802 -0.428412 -0.059012
C  -0.10221 1.825155 0.007983
C  -2.54524 1.541455 -0.008675
C  -1.404676 2.368877 0.019257
C  -3.578816 -0.75115 -0.110025
C  2.570777 0.379246 0.00353
C  3.769681 -0.625133 0.12488
H  -0.967435 -1.518025 -0.081754
H  0.775818 2.472563 0.027843
H  -3.550884 1.971676 0.00675
H  1.3246 -1.249793 -0.086394
H  -1.526436 3.456033 0.050514
