program: Gaussian 09
title: 000137242
version: EM64L-G09RevD.01
frameworkgroup: C1[X(C3H6BrF)]
method: RPBEPBE
basis: SDD
operation: Freq
keyword: #p
keyword: freq=noraman
keyword: PBEPBE/SDD
title: #p freq=noraman PBEPBE/SDD
converged: YES YES NO NO
title: Mulliken charges:
elementType: Br F C C C H H H H H H
charge: -0.005666 -0.230293 0.097693 -0.667323 -0.683928 0.226902 0.270113 0.294141 0.231253 0.214950 0.252159
chargesum: 0.00000
title: Mulliken charges with hydrogens summed into heavy atoms:
elementType: Br F C C C
charge: -0.005666 -0.230293 0.324595 -0.103069 0.014433
polarizability: 6.74457890e+01 7.58177052e+00 3.80004491e+01 -3.24246576e+00 -1.72838387e+00 3.39548885e+01
1716.lowfreq: -18.9978 -10.8601 -8.1339 -0.0007 -0.0004 -0.0002 80.7095 170.3001 205.9209
frequency: 80.7050 170.3001 205.9208 280.4146 400.9394 424.6204 632.3889 778.9624 861.3863 914.9396 1014.7653 1082.0784 1133.7475 1177.7922 1233.1564 1312.9342 1333.5287 1390.0484 1421.8154 1459.5625 1473.9244 2995.7933 3043.9779 3058.2610 3094.8393 3107.4779 3145.3428
redmass: 4.0450 4.1273 1.0928 3.2193 3.2584 2.6678 4.1345 3.1436 1.5340 1.8907 1.6266 2.0536 1.7436 1.5021 1.1976 1.2653 1.3549 1.2192 1.1165 1.0519 1.0487 1.0358 1.0873 1.0575 1.0993 1.1002 1.1095
irintensity: 1.3425 0.5087 0.1776 1.0011 14.1594 7.9446 20.6481 16.5841 7.4250 19.9561 37.6546 14.1829 23.7464 10.0513 24.1901 4.4503 6.9500 22.4285 13.5246 8.9157 12.7044 11.7178 12.9526 14.2768 24.2371 20.1236 7.3007
temp: 298.150 k
press: 1.00000 atm
elementType: 35 9 6 6 6 1 1 1 1 1 1
symmnumber: 1
zpe: 222682.6 jmol-1
zpe.correction: 0.084815 hartree
zpe.thermalcorrener: 0.091124 hartree
zpe.thermalcorrenthalpy: 0.092068 hartree
zpe.thermalcorrgfe: 0.053365 hartree
zpe.sumelectzpe: -230.801592 hartree
zpe.sumelectthermal: -230.795283 hartree
zpe.sumelectthermalent: -230.794339 hartree
zpe.sumelectthermalfe: -230.833043 hartree
dipole: -2.1977 -2.9092 -0.3018
dipole: 3.6584
quadrupole: -38.0548 -41.6640 -38.1811
quadrupole: 4.4016 0.8075 -1.0281
quadrupole: 1.2452 -2.3640 1.1189 4.4016 0.8075 -1.0281
hfenergy: -230.8864074 hartree
pointgroup: C01 [X(C3H6Br1F1)]
dipole: -0.8961012 -1.1227103 -0.090585 debye
dipolederiv: -0.5103592 -0.04483 0.0084093 -0.0863309 -0.1388007 0.0129555 0.0777445 0.0256062 -0.1408552 -0.3701862 0.0088056 -0.0162658 0.036487 -0.7104714 -0.0924919 -0.0089771 -0.1404944 -0.3140272 0.3813665 -0.005561 0.0200529 -0.2158622 0.7445864 0.1365152 0.1259796 0.1177658 0.4002185 0.6535366 0.2251568 -0.1361366 0.2041413 0.0586253 -0.0397644 -0.216557 0.0149434 0.0747415 -0.2372531 -0.104265 0.0120738 0.1226044 -0.0261529 -0.000887 -0.0556038 0.01234 0.0569365 0.0415148 -0.0126618 0.0441109 0.0035911 0.0061258 0.0218965 0.0177204 -0.0141692 -0.1275451 -0.0342852 -0.085515 0.0239833 -0.0462741 -0.0814819 -0.0246004 0.0272698 -0.0309012 0.0922265 -0.047125 -0.0289089 0.0869346 -0.0370126 0.0973917 0.004498 0.0282479 0.0168418 -0.0602716 0.0989043 -0.0186335 -0.007706 -0.021303 0.1026111 0.0201546 0.0533079 0.0344217 -0.1242845 0.1062565 0.0059168 0.0140703 -0.0308136 -0.0932563 -0.0952923 0.0071496 -0.0960235 0.0607928 -0.0823701 0.0604959 -0.0495268 0.0707728 0.0408229 0.0570164 -0.0562817 0.0596693 0.0820677 unknown
polarizability: 67.2901681|6.8960552|37.7506393|-5.0606488|-1.9787369|34.3603191 unknown
InChI: InChI=1S/C3H6BrF/c1-3(5)2-4/h3H,2H2,1H3
charge 0 multiplicity 1
11 atoms
Br 2.424898 -0.075323 -0.230293
F  -0.5560 1.386837 0.225891
C  -0.532064 0.022364 -0.323764
C  0.603454 -0.739614 0.34992
C  -1.902019 -0.609426 -0.051198
H  -0.34918 0.136354 -1.407634
H  0.586096 -1.8064 0.077918
H  0.578277 -0.612579 1.442665
H  -2.080808 -0.722442 1.03228
H  -1.978035 -1.602309 -0.530338
H  -2.692718 0.03754 -0.466247
