program: Gaussian 09
title: 000137240
version: EM64L-G09RevD.01
frameworkgroup: C1[X(C7H16O)]
method: RPBEPBE
basis: SDD
operation: Freq
keyword: #pfreq=noraman
keyword: PBEPBE/SDD
title: #p freq=noraman PBEPBE/SDD
converged: YES YES NO NO
title: Mulliken charges:
elementType: O C C C C C C C H H H H H H H H H H H H H H H H
charge: -0.279515 -0.373188 -0.243847 0.060659 -0.347100 -0.693061 -0.693676 -0.686270 0.205049 0.203399 0.171374 0.180006 0.172047 0.190192 0.191902 0.210516 0.221155 0.223776 0.196122 0.231696 0.221299 0.211356 0.211663 0.214447
chargesum: 0.00000
title: Mulliken charges with hydrogens summed into heavy atoms:
elementType: O C C C C C C C
charge: -0.279515 0.035260 0.107533 0.232706 0.034994 -0.037613 -0.044560 -0.048805
polarizability: 1.02198813e+02 4.60457263e-01 7.46283155e+01 -3.67016776e-01 3.08188648e-01 6.88085782e+01
1716.lowfreq: -0.0008 0.0002 0.0006 6.8519 12.3860 17.1748 44.1619 63.8004 95.2470
frequency: 43.8039 63.5529 95.2280 113.6355 137.6860 189.4011 230.4829 232.3007 248.1453 276.3331 375.4749 396.3226 464.9740 496.8387 741.5635 786.0705 808.9495 886.6298 906.7637 917.1370 932.6892 939.0198 1004.9667 1045.7424 1082.9186 1110.5346 1123.0336 1142.3446 1155.6676 1180.6500 1210.8953 1271.1581 1274.1868 1284.6042 1318.0089 1330.0446 1349.7136 1370.6374 1385.6121 1389.9179 1392.5239 1455.0371 1464.4968 1470.0058 1470.9870 1473.8218 1477.4177 1483.4090 1487.7738 1492.7013 2905.9351 2913.5958 2958.6583 2964.9703 2974.3429 2980.5761 2989.9430 2990.7286 3008.0707 3053.6585 3072.8135 3073.4774 3074.7055 3083.8946 3090.7951 3098.1068
redmass: 2.0225 2.4081 3.0541 1.9825 2.3523 1.0703 1.5220 1.1201 1.8774 2.7145 2.6305 2.6631 2.6278 2.8289 1.0735 3.1250 1.1483 2.4917 1.8065 1.2308 1.3379 1.1773 4.7931 3.8431 2.2166 2.0420 2.1963 1.6491 1.9168 1.9634 1.3780 1.2708 1.1802 1.0804 1.2046 1.4604 1.5177 1.2647 1.3005 1.2297 1.3326 1.0494 1.0553 1.0665 1.0499 1.0657 1.0423 1.0651 1.0596 1.0839 1.0589 1.0811 1.1021 1.0592 1.0362 1.0358 1.0366 1.0583 1.1005 1.1039 1.1010 1.0995 1.0989 1.1005 1.0995 1.1000
irintensity: 0.0463 0.7715 0.7043 0.0181 4.8198 0.4832 0.2852 0.0290 1.3276 0.2255 0.9076 2.1109 6.0044 1.0195 9.0030 6.4148 0.3058 7.7056 10.9765 2.4693 0.5039 1.3406 52.7763 45.2457 5.4238 57.0023 25.2014 11.7033 25.9502 12.5590 0.6541 0.2122 1.5556 0.0870 37.8157 7.3210 4.0606 29.1224 16.6545 20.7394 2.1630 5.2021 2.5966 0.5902 4.8191 3.2723 12.5807 8.5521 9.3418 17.4493 37.5056 85.9489 42.1519 38.3276 34.4496 26.4330 18.3499 48.2518 6.9420 26.6290 95.0410 54.1913 36.6831 15.6935 63.8146 36.5199
temp: 298.150 k
press: 1.00000 atm
elementType: 8 6 6 6 6 6 6 6 1 1 1 1 1 1 1 1 1 1 1 1 1 1 1 1
symmnumber: 1
zpe: 569518.7 jmol-1
zpe.correction: 0.216918 hartree
zpe.thermalcorrener: 0.228064 hartree
zpe.thermalcorrenthalpy: 0.229008 hartree
zpe.thermalcorrgfe: 0.179855 hartree
zpe.sumelectzpe: -350.860690 hartree
zpe.sumelectthermal: -350.849545 hartree
zpe.sumelectthermalent: -350.848600 hartree
zpe.sumelectthermalfe: -350.897753 hartree
dipole: -0.1568 1.2157 0.8890
dipole: 1.5142
quadrupole: -48.8784 -53.0949 -51.9564
quadrupole: -0.6167 -0.9309 -0.5727
quadrupole: 2.4315 -1.7850 -0.6465 -0.6167 -0.9309 -0.5727
hfenergy: -351.0776085 hartree
pointgroup: C01 [X(C7H16O1)]
dipole: -0.0506501 0.4606752 0.3743306 debye
dipolederiv: -1.3104038 -0.0149497 -0.0164739 -0.0578253 -0.4558721 0.0470911 0.0029707 0.0134143 -0.4033732 -0.110239 0.006808 0.0057446 -0.000775 0.0748129 -0.036809 -0.0138276 -0.0365052 0.1271012 0.7070887 0.0933826 0.0589356 0.2272818 0.355971 -0.0590805 0.1742682 -0.0459436 0.4063709 0.8817572 -0.0541212 -0.0364941 -0.1896901 0.423895 -0.054532 -0.1756326 -0.0559169 0.4122283 0.0394213 0.0143645 0.0071045 0.0842753 0.1114923 -0.0368382 0.0442136 -0.0372804 0.1660357 -0.0800311 0.0387058 -0.0174891 0.1165467 -0.1964247 0.06614 0.0131162 0.0764926 0.027673 -0.094505 -0.0679754 -0.0339716 -0.0828983 -0.0785111 -0.0129871 -0.0171108 -0.014791 0.0650077 -0.0561729 0.042911 0.021342 0.0020819 0.0638088 -0.0161026 -0.0003274 -0.0163506 0.0856889 0.0578126 -0.0070354 0.0046946 0.0051324 0.0631801 -0.0309552 0.0064819 -0.0515715 -0.1577251 0.0484073 0.0000356 -0.006251 0.0110991 -0.1371628 0.0743109 0.0024061 0.0946693 0.0350436 -0.0293603 -0.0092934 0.0358912 -0.0471888 0.0229945 -0.0235848 -0.0427286 -0.0638258 -0.2311962 -0.0298628 -0.0131701 -0.0110035 -0.0733679 -0.2088847 0.0644486 -0.0223758 0.0953084 -0.0000404 -0.0533745 -0.000917 -0.0621373 0.0401636 -0.0025468 -0.0159012 0.0430564 -0.0044336 -0.2541337 0.0309753 0.0084152 0.031958 -0.004452 0.0565916 -0.0455461 -0.0037673 -0.0742331 -0.2006668 0.0329888 0.0280852 -0.0098559 -0.0079815 -0.1756855 0.0796821 -0.0007612 0.1089754 0.034022 -0.1568945 0.0856376 0.0725855 0.0725481 0.0799966 -0.0036127 0.0808229 -0.017106 0.0623755 0.0064024 -0.1536132 -0.0489358 -0.1276784 -0.0648125 -0.0320587 -0.0586744 -0.0382918 0.0599904 0.1071649 0.0051071 0.0027376 -0.001639 0.0699386 -0.0336552 -0.0278225 0.0276312 -0.1456971 -0.1653054 0.0214572 0.0720573 0.0567367 0.0759244 -0.0401461 0.0878642 -0.0260848 0.0606476 0.0967534 0.0677974 -0.0338106 0.0286957 -0.1275636 0.072374 -0.0300241 0.0791113 0.0642998 0.1012822 -0.0074003 0.0075987 -0.0181467 0.0860422 0.0173944 -0.0450702 -0.0332285 -0.1480717 0.0793972 -0.0132532 0.0208883 0.0520053 -0.1405373 0.0935565 0.0020973 0.1101458 0.036847 0.0793263 0.0113663 -0.0172185 0.0306233 0.0760355 -0.0325959 0.0463294 -0.050179 -0.1796085 -0.1826284 -0.0823447 -0.0478966 -0.1155469 0.0273179 -0.0405922 -0.0655042 -0.0400063 0.0771808 unknown
polarizability: 102.2028771|-0.4536144|74.5774837|0.0671296|0.6238232|68.8553457 unknown
InChI: InChI=1S/C7H16O/c1-4-5-6-8-7(2)3/h7H,4-6H2,1-3H3
charge 0 multiplicity 1
24 atoms
O  -0.863982 -0.359395 -0.253304
C  1.556049 -0.348538 -0.164059
C  0.286168 0.413266 0.232659
C  -2.171154 0.084349 0.279388
C  2.848353 0.392482 0.250452
C  -2.574958 1.472409 -0.26011
C  -3.165224 -1.012537 -0.122018
C  4.125452 -0.378816 -0.147852
H  1.545644 -0.503599 -1.260596
H  1.528651 -1.353648 0.299398
H  0.227724 0.528094 1.340389
H  0.293547 1.431272 -0.216104
H  -2.09612 0.132575 1.391502
H  2.844485 0.55793 1.347523
H  2.863197 1.398379 -0.216997
H  -3.578718 1.751077 0.111217
H  -1.868824 2.260259 0.058537
H  -2.603323 1.455459 -1.36473
H  -4.173403 -0.790894 0.272541
H  -2.836077 -1.989901 0.270283
H  -3.22484 -1.085768 -1.222674
H  4.149552 -1.376388 0.329551
H  4.169984 -0.53073 -1.242698
H  5.038615 0.164965 0.156503
