program: Gaussian 09
title: 000137228
version: EM64L-G09RevD.01
frameworkgroup: C1[X(C5H10Br2)]
method: RPBEPBE
basis: SDD
operation: Freq
keyword: #pfreq=noraman
keyword: PBEPBE/SDD
title: #p freq=noraman PBEPBE/SDD
converged: NO YES NO NO
title: Mulliken charges:
elementType: Br Br C C C C C H H H H H H H H H H
charge: -0.033369 -0.033480 -0.275233 -0.452552 -0.452436 -0.645790 -0.645742 0.256340 0.256218 0.296367 0.296295 0.219706 0.251355 0.245629 0.219744 0.245543 0.251407
chargesum: 0.00000
title: Mulliken charges with hydrogens summed into heavy atoms:
elementType: Br Br C C C C C
charge: -0.033369 -0.033480 0.237324 -0.156185 -0.156141 0.070899 0.070952
polarizability: 1.19507459e+02 -2.36210463e-04 8.16211621e+01 3.26553891e+00 2.77831702e-03 5.88918096e+01
1716.lowfreq: -5.3961 -0.0004 -0.0003 0.0002 6.7632 16.0753 53.9084 86.1381 94.1689
frequency: 53.9070 86.1303 94.1684 184.5142 231.0081 233.0750 256.3578 287.7064 295.4449 396.5938 422.6372 528.3128 633.0648 857.2647 859.3697 905.3379 985.8358 996.5488 1025.0003 1112.7497 1122.3553 1142.4195 1193.1790 1208.4102 1251.9097 1309.3863 1330.1693 1344.7573 1390.1322 1392.6818 1458.2682 1459.1317 1463.8924 1472.0719 1479.0626 2977.1991 2977.3643 3020.1839 3061.1194 3063.4108 3072.3604 3079.4909 3092.2378 3109.6625 3111.6702
redmass: 3.4200 2.8560 11.1719 3.7849 1.2052 1.2534 3.6770 2.4816 2.4759 2.7741 1.9971 3.6374 3.1794 1.7531 2.8338 1.5746 1.4463 1.2835 1.5033 2.0167 2.5517 2.0987 1.2435 1.2673 1.2798 1.3150 1.4094 1.2824 1.2170 1.2085 1.0747 1.0456 1.0456 1.0472 1.0565 1.0399 1.0400 1.0602 1.0896 1.0897 1.0937 1.0907 1.1013 1.1006 1.1002
irintensity: 0.2499 0.6595 0.6829 0.9873 0.0360 2.9491 12.4008 2.2323 0.4096 0.0418 5.8015 34.7850 12.4818 13.3035 6.4444 1.4637 27.1357 4.7934 12.1335 2.3789 2.0714 56.1643 33.6892 7.6468 9.9902 22.7123 20.3263 3.2471 32.9379 15.4268 1.9820 9.3718 10.0335 10.6404 18.5304 20.0748 16.5817 3.9510 1.0600 0.2914 35.0872 8.1828 20.4806 18.4674 28.3515
temp: 298.150 k
press: 1.00000 atm
elementType: 35 35 6 6 6 6 6 1 1 1 1 1 1 1 1 1 1
symmnumber: 1
zpe: 365025.8 jmol-1
zpe.correction: 0.139031 hartree
zpe.thermalcorrener: 0.148571 hartree
zpe.thermalcorrenthalpy: 0.149515 hartree
zpe.thermalcorrgfe: 0.101854 hartree
zpe.sumelectzpe: -222.875138 hartree
zpe.sumelectthermal: -222.865597 hartree
zpe.sumelectthermalent: -222.864653 hartree
zpe.sumelectthermalfe: -222.912315 hartree
dipole: -0.0001 3.0857 0.0001
dipole: 3.0857
quadrupole: -75.4929 -60.0045 -62.0925
quadrupole: 0.0032 -1.8775 -0.0003
quadrupole: -9.6296 5.8588 3.7708 0.0032 -1.8775 -0.0003
hfenergy: -223.0141686 hartree
pointgroup: C01 [X(C5H10Br2)]
dipole: -0.0079847 1.2137584 -0.0241838 debye
dipolederiv: -0.5804604 -0.1808172 -0.1201955 -0.2492764 -0.3322132 -0.113684 -0.0884986 -0.0705027 -0.1910478 -0.585784 0.1726067 -0.128669 0.2422552 -0.3195353 0.1172606 -0.0992948 0.0745258 -0.1986176 -0.2832931 -0.0019743 -0.054091 -0.0014293 -0.1470204 0.0032936 -0.0235045 0.0031729 0.0308704 0.7625894 0.3157086 0.1351671 0.2728221 0.4944518 0.1589168 0.1370181 0.140433 0.2235094 0.7699623 -0.306446 0.1497039 -0.2635517 0.4752404 -0.1673493 0.149796 -0.1487874 0.2357033 -0.1054435 -0.0613728 -0.0411442 0.0162869 -0.1203525 -0.14509 0.0282553 -0.0781326 -0.037957 -0.1061799 0.0596507 -0.0454456 -0.0147143 -0.1113839 0.1477637 0.0277881 0.0814559 -0.0465 0.0527568 -0.0282898 0.0335056 -0.0215031 0.0291737 0.0699301 0.0182384 0.084286 -0.0321099 0.0520549 0.0300004 0.0333871 0.0226031 0.0238792 -0.0716195 0.0185649 -0.0861812 -0.0263447 -0.0209339 -0.0711877 0.0295222 -0.0352288 -0.058847 0.0531623 0.0022432 0.0315474 -0.0669254 -0.0223555 0.0728492 0.0273378 0.0357603 -0.0607901 -0.0530763 0.0011424 -0.0316432 -0.0636424 -0.0092332 -0.1341726 -0.0080374 -0.164701 -0.024388 -0.0423779 -0.0532029 -0.058167 0.0523448 -0.0704415 0.1228688 -0.0014425 0.0950628 0.0560442 0.0070666 -0.0375612 0.0158223 0.0871639 0.1135053 0.0190666 -0.0007604 -0.0108919 0.0333743 0.1211061 0.006311 0.0552926 -0.0547954 -0.0125654 0.1339204 -0.0135068 0.1624557 -0.0167317 0.0447359 -0.0600154 0.0600168 0.0482255 0.1136531 -0.0181032 0.0011157 0.0119505 0.026321 -0.1242817 0.0062919 -0.0582906 -0.0479889 -0.0678315 -0.1243081 0.0035527 -0.0979001 0.0527775 -0.005757 -0.0335719 -0.0148481 0.0881117 unknown
polarizability: 117.6152859|0.4551899|81.6173842|11.0242437|-0.3410368|60.7877608 unknown
InChI: InChI=1S/C5H10Br2/c1-4(6)3-5(2)7/h4-5H,3H2,1-2H3
charge 0 multiplicity 1
17 atoms
Br -2.832678 -1.085531 -0.505535
Br 2.834663 -1.027253 0.567624
C  -0.001632 -0.623444 0.021699
C  -1.276597 0.225855 -0.182903
C  1.261823 0.25022 0.193318
C  -1.651917 1.1382 0.988727
C  1.625712 1.120783 -1.013097
H  -0.13346 -1.261326 0.91364
H  0.139244 -1.292719 -0.845537
H  -1.247821 0.778678 -1.136035
H  1.225233 0.839619 1.124098
H  -0.878538 1.920688 1.123085
H  -2.614447 1.643823 0.807348
H  -1.731376 0.563841 1.927841
H  0.843314 1.888733 -1.175869
H  1.710623 0.511765 -1.929646
H  2.582653 1.643771 -0.852657
