program: Gaussian 09
title: 000137214
version: EM64L-G09RevD.01
frameworkgroup: C1[X(C8H7IO2)]
method: RPBEPBE
basis: SDD
operation: Freq
keyword: #pfreq=noraman
keyword: PBEPBE/SDD
title: #p freq=noraman PBEPBE/SDD
converged: YES YES NO NO
title: Mulliken charges:
elementType: I O O C C C C C C C C H H H H H H H
charge: 0.099873 -0.405975 -0.234548 0.453393 -0.610958 -0.341894 -0.406913 -0.158825 -0.149932 -0.349250 0.214017 0.245970 0.252462 0.270167 0.240801 0.251025 0.251257 0.379332
chargesum: 0.00000
title: Mulliken charges with hydrogens summed into heavy atoms:
elementType: I O O C C C C C C C C
charge: 0.099873 -0.026643 -0.234548 0.453393 -0.112527 -0.071727 -0.166113 0.092200 0.101325 -0.349250 0.214017
polarizability: 1.79836580e+02 4.62816326e+00 9.95518928e+01 -7.05396769e+00 4.37688131e+00 5.50347135e+01
1716.lowfreq: 0.0005 0.0007 0.0008 1.0276 4.8794 9.8943 22.5830 33.5269 61.7655
frequency: 22.4481 33.4663 61.7594 123.7352 177.6733 231.3454 295.3078 323.9184 394.2020 404.6921 481.2735 508.3699 563.1584 624.6051 641.7691 695.2696 714.5006 796.6233 828.3974 836.4928 873.5363 928.9469 959.0284 973.9439 991.3004 1056.0747 1060.4900 1114.6251 1180.4968 1194.2826 1202.9146 1268.6266 1297.0655 1327.6248 1373.4195 1394.6765 1453.9427 1470.6470 1577.4515 1594.5454 1661.7094 3011.9688 3103.9931 3133.6057 3143.9602 3168.0499 3171.6310 3505.0232
redmass: 6.5841 5.4272 8.3598 7.5274 6.2286 8.6042 5.3545 4.9413 2.4383 2.8304 3.2737 2.9776 4.2346 6.7568 1.5994 3.1341 4.1363 2.0539 2.8880 1.2668 3.5483 1.8766 1.4446 1.3873 5.6621 2.4940 1.9929 1.4102 1.2288 1.1229 2.4817 1.4762 1.3117 2.3442 6.1082 2.3111 1.1440 2.1505 7.1345 6.0103 8.5725 1.0638 1.0980 1.0899 1.0895 1.0954 1.0966 1.0639
irintensity: 2.0024 0.8510 0.9785 0.0523 0.3520 1.5600 0.9660 1.2034 8.0374 0.3161 14.7418 49.9261 38.5982 1.4636 92.6945 64.6035 27.2582 35.5179 42.8911 2.7757 9.0824 20.0871 7.6751 1.2670 73.7772 31.8531 207.7553 26.5539 15.7574 0.4446 9.8617 2.4120 4.2182 72.1508 9.0484 18.6104 30.1493 74.7235 0.3068 9.5052 204.8024 10.4898 4.9471 9.1437 0.9553 9.7189 0.1793 24.9284
temp: 298.150 k
press: 1.00000 atm
elementType: 53 8 8 6 6 6 6 6 6 6 6 1 1 1 1 1 1 1
symmnumber: 1
zpe: 340652.1 jmol-1
zpe.correction: 0.129748 hartree
zpe.thermalcorrener: 0.140189 hartree
zpe.thermalcorrenthalpy: 0.141134 hartree
zpe.thermalcorrgfe: 0.089743 hartree
zpe.sumelectzpe: -470.218540 hartree
zpe.sumelectthermal: -470.208099 hartree
zpe.sumelectthermalent: -470.207154 hartree
zpe.sumelectthermalfe: -470.258545 hartree
dipole: 1.7955 1.5338 -0.1294
dipole: 2.3649
quadrupole: -72.0808 -77.4667 -77.5276
quadrupole: 5.5256 1.4162 -0.2521
quadrupole: 3.6109 -1.7750 -1.8359 5.5256 1.4162 -0.2521
hfenergy: -470.348288 hartree
pointgroup: C01 [X(C8H7I1O2)]
dipole: -0.7038554 -0.5082978 -0.3345719 debye
dipolederiv: -0.5407055 0.0102958 -0.1330587 0.009349 -0.0266404 -0.0022071 -0.1433359 -0.0022288 -0.0454027 -0.8439981 -0.4067856 0.0857469 -0.4625208 -0.7281814 0.230381 0.2909387 0.3064308 -0.4104521 -0.6076485 0.0977078 0.1392658 -0.0460065 -0.8939642 -0.0345034 0.2294425 -0.234895 -0.4712607 0.4327202 -0.0480252 0.0256136 0.0012259 -0.0334202 -0.0427559 0.2064281 -0.0411153 -0.0650744 -0.3176944 0.0710326 0.1611345 0.1434593 0.0577117 -0.0168326 0.1350697 -0.0443071 -0.0365163 -0.0723563 -0.0769833 0.0152357 0.018336 0.0009858 0.0464596 0.0059382 0.0355327 -0.1178488 -0.0816128 0.0710637 0.0689104 -0.0676697 0.0458572 0.0378789 0.0141137 0.0596545 -0.1167268 -0.4287538 0.1278927 -0.0547096 0.000123 0.0461194 0.0261751 -0.1000646 0.0715511 -0.0990334 -0.4168468 -0.126797 -0.1091193 0.0122064 0.0323056 0.0255376 -0.0963726 -0.0063162 -0.1127861 1.188123 -0.0260568 0.3554227 -0.0288011 -0.0411078 0.0218085 0.3686833 0.0229595 -0.0607666 1.0841057 0.2436522 -0.4861234 0.335637 1.3322031 -0.0423943 -0.8688571 0.0818954 0.6510658 0.0550231 -0.0067352 -0.0045261 -0.0668253 -0.0464853 -0.0776995 0.0087682 -0.0410153 0.0785754 0.0204724 0.0124074 -0.0270468 0.05584 0.0229034 0.0955445 -0.0417634 0.0495746 0.011473 0.0594719 0.0776741 -0.0271775 0.0626728 0.0218619 -0.0156215 -0.021735 -0.0218737 0.1370564 0.0073058 -0.0832153 -0.0656472 -0.0665442 -0.0197081 -0.0574219 -0.0539119 -0.0627953 0.1217534 0.0641289 -0.0600592 -0.0366685 -0.0568544 -0.0022509 -0.0528807 -0.04072 -0.0556641 0.135789 0.0528587 0.0811997 -0.0065682 0.0742184 -0.0091145 -0.0204463 -0.0149346 -0.0175154 0.1550223 0.3454064 0.0417317 0.0993157 0.0821542 0.2409246 -0.1210219 0.1223127 -0.0998723 0.2451327 unknown
polarizability: 176.625896|-3.7451242|96.9977523|21.3325808|10.5166691|60.7995381 unknown
InChI: InChI=1S/C8H7IO2/c9-7-3-1-6(2-4-7)5-8(10)11/h1-4,10H,5H2
charge 0 multiplicity 1
18 atoms
I  4.451239 -0.100224 0.742769
O  -3.525808 -0.60174 0.557979
O  -2.809535 1.607306 0.533842
C  -0.348829 -0.038893 -0.603818
C  -1.814233 -0.022584 -1.043885
C  0.2839 1.141294 -0.137669
C  0.40303 -1.235998 -0.671003
C  1.642547 1.129514 0.248117
C  1.765277 -1.263957 -0.290237
C  2.37418 -0.075852 0.165523
C  -2.736371 0.447758 0.071857
H  -2.130275 -1.022606 -1.377074
H  -1.942055 0.683792 -1.885597
H  -0.289647 2.071662 -0.061938
H  -0.069745 -2.160726 -1.021618
H  2.117622 2.047206 0.606196
H  2.332627 -2.197027 -0.350001
H  -4.098724 -0.267527 1.301658
